{"text_format":"1","workbook":"xlsx","n_sheets":6,"sheets":["Totalen","Blad7","Scoreblad","Gasten","DATA","Blad1"],"not_rendered":{"charts":0,"images":1,"macros":1,"external_links":0,"defined_names":4,"comments":0,"pivot_tables":1},"unopened":[],"bounds":{"document_bytes":16777216,"sheet_cells":100000,"rows_first":2000,"rows_last":500,"rows_between":2000,"halvings":0,"cell_chars":16384,"cell_head_chars":4096},"cells_cut":0,"cells_raw":0,"read":"whole","date_system":"1900"}

{"sheet":"Totalen","index":0,"n_rows":33,"n_cols":14,"rows_kept":33,"cut":false,"hidden":false,"merged":[[0,3,0,4]]}
["Naam","#","Score",null,null,null,"Naam","Stb","Pnt",null,null,null,"Weeknummer",43]
[{"$f":"INDEX(Scoreblad!$B$12:$B$43,MATCH(LARGE((Scoreblad!$D$12:$D$43)+ROW(Scoreblad!$D$12:$D$43)/1000,ROW()-ROW($A$2)+1),(Scoreblad!$D$12:$D$43)+ROW(Scoreblad!$D$12:$D$43)/1000,0))","v":"Walter Cats"},{"$f":"INDEX(Scoreblad!$C$12:$C$43,MATCH(LARGE((Scoreblad!$D$12:$D$43)+ROW(Scoreblad!$D$12:$D$43)/1000,ROW()-ROW($A$2)+1),(Scoreblad!$D$12:$D$43)+ROW(Scoreblad!$D$12:$D$43)/1000,0))","v":26},{"$f":"LARGE(Scoreblad!$D$12:$D$43,ROW()-ROW($A$2)+1)","v":28.153846153846153},null,null,null,{"$f":"INDEX(DATA!$G$3:$G$34,MATCH(LARGE((DATA!$I$3:$I$34)+ROW(DATA!$I$3:$I$34)/1000,ROW()-ROW($G$2)+1),(DATA!$I$3:$I$34)+ROW(DATA!$I$3:$I$34)/1000,0))","v":"Jos Bergmans"},{"$f":"INDEX(DATA!$H$3:$H$34,MATCH(LARGE((DATA!$I$3:$I$34)+ROW(DATA!$I$3:$I$34)/1000,ROW()-ROW($G$2)+1),(DATA!$I$3:$I$34)+ROW(DATA!$I$3:$I$34)/1000,0))","v":20},{"$f":"LARGE(DATA!$I$3:$I$34,ROW()-ROW($G$2)+1)","v":32}]
[{"$f":"INDEX(Scoreblad!$B$12:$B$43,MATCH(LARGE((Scoreblad!$D$12:$D$43)+ROW(Scoreblad!$D$12:$D$43)/1000,ROW()-ROW($A$2)+1),(Scoreblad!$D$12:$D$43)+ROW(Scoreblad!$D$12:$D$43)/1000,0))","v":"Paul Nijmeijer"},{"$f":"INDEX(Scoreblad!$C$12:$C$43,MATCH(LARGE((Scoreblad!$D$12:$D$43)+ROW(Scoreblad!$D$12:$D$43)/1000,ROW()-ROW($A$2)+1),(Scoreblad!$D$12:$D$43)+ROW(Scoreblad!$D$12:$D$43)/1000,0))","v":22},{"$f":"LARGE(Scoreblad!$D$12:$D$43,ROW()-ROW($A$2)+1)","v":27.09090909090909},null,null,null,{"$f":"INDEX(DATA!$G$3:$G$34,MATCH(LARGE((DATA!$I$3:$I$34)+ROW(DATA!$I$3:$I$34)/1000,ROW()-ROW($G$2)+1),(DATA!$I$3:$I$34)+ROW(DATA!$I$3:$I$34)/1000,0))","v":"Guust v/d Bemd"},{"$f":"INDEX(DATA!$H$3:$H$34,MATCH(LARGE((DATA!$I$3:$I$34)+ROW(DATA!$I$3:$I$34)/1000,ROW()-ROW($G$2)+1),(DATA!$I$3:$I$34)+ROW(DATA!$I$3:$I$34)/1000,0))","v":19},{"$f":"LARGE(DATA!$I$3:$I$34,ROW()-ROW($G$2)+1)","v":31}]
[{"$f":"INDEX(Scoreblad!$B$12:$B$43,MATCH(LARGE((Scoreblad!$D$12:$D$43)+ROW(Scoreblad!$D$12:$D$43)/1000,ROW()-ROW($A$2)+1),(Scoreblad!$D$12:$D$43)+ROW(Scoreblad!$D$12:$D$43)/1000,0))","v":"Michiel Vroon"},{"$f":"INDEX(Scoreblad!$C$12:$C$43,MATCH(LARGE((Scoreblad!$D$12:$D$43)+ROW(Scoreblad!$D$12:$D$43)/1000,ROW()-ROW($A$2)+1),(Scoreblad!$D$12:$D$43)+ROW(Scoreblad!$D$12:$D$43)/1000,0))","v":18},{"$f":"LARGE(Scoreblad!$D$12:$D$43,ROW()-ROW($A$2)+1)","v":26.444444444444443},null,null,null,{"$f":"INDEX(DATA!$G$3:$G$34,MATCH(LARGE((DATA!$I$3:$I$34)+ROW(DATA!$I$3:$I$34)/1000,ROW()-ROW($G$2)+1),(DATA!$I$3:$I$34)+ROW(DATA!$I$3:$I$34)/1000,0))","v":"Tonnie Breeweg"},{"$f":"INDEX(DATA!$H$3:$H$34,MATCH(LARGE((DATA!$I$3:$I$34)+ROW(DATA!$I$3:$I$34)/1000,ROW()-ROW($G$2)+1),(DATA!$I$3:$I$34)+ROW(DATA!$I$3:$I$34)/1000,0))","v":18},{"$f":"LARGE(DATA!$I$3:$I$34,ROW()-ROW($G$2)+1)","v":30}]
[{"$f":"INDEX(Scoreblad!$B$12:$B$43,MATCH(LARGE((Scoreblad!$D$12:$D$43)+ROW(Scoreblad!$D$12:$D$43)/1000,ROW()-ROW($A$2)+1),(Scoreblad!$D$12:$D$43)+ROW(Scoreblad!$D$12:$D$43)/1000,0))","v":"Daan vd Tuijn"},{"$f":"INDEX(Scoreblad!$C$12:$C$43,MATCH(LARGE((Scoreblad!$D$12:$D$43)+ROW(Scoreblad!$D$12:$D$43)/1000,ROW()-ROW($A$2)+1),(Scoreblad!$D$12:$D$43)+ROW(Scoreblad!$D$12:$D$43)/1000,0))","v":21},{"$f":"LARGE(Scoreblad!$D$12:$D$43,ROW()-ROW($A$2)+1)","v":26.285714285714285},null,null,null,{"$f":"INDEX(DATA!$G$3:$G$34,MATCH(LARGE((DATA!$I$3:$I$34)+ROW(DATA!$I$3:$I$34)/1000,ROW()-ROW($G$2)+1),(DATA!$I$3:$I$34)+ROW(DATA!$I$3:$I$34)/1000,0))","v":"Paul Nijmeijer"},{"$f":"INDEX(DATA!$H$3:$H$34,MATCH(LARGE((DATA!$I$3:$I$34)+ROW(DATA!$I$3:$I$34)/1000,ROW()-ROW($G$2)+1),(DATA!$I$3:$I$34)+ROW(DATA!$I$3:$I$34)/1000,0))","v":18},{"$f":"LARGE(DATA!$I$3:$I$34,ROW()-ROW($G$2)+1)","v":30}]
[{"$f":"INDEX(Scoreblad!$B$12:$B$43,MATCH(LARGE((Scoreblad!$D$12:$D$43)+ROW(Scoreblad!$D$12:$D$43)/1000,ROW()-ROW($A$2)+1),(Scoreblad!$D$12:$D$43)+ROW(Scoreblad!$D$12:$D$43)/1000,0))","v":"Jan Hoogstrate"},{"$f":"INDEX(Scoreblad!$C$12:$C$43,MATCH(LARGE((Scoreblad!$D$12:$D$43)+ROW(Scoreblad!$D$12:$D$43)/1000,ROW()-ROW($A$2)+1),(Scoreblad!$D$12:$D$43)+ROW(Scoreblad!$D$12:$D$43)/1000,0))","v":25},{"$f":"LARGE(Scoreblad!$D$12:$D$43,ROW()-ROW($A$2)+1)","v":26},null,null,null,{"$f":"INDEX(DATA!$G$3:$G$34,MATCH(LARGE((DATA!$I$3:$I$34)+ROW(DATA!$I$3:$I$34)/1000,ROW()-ROW($G$2)+1),(DATA!$I$3:$I$34)+ROW(DATA!$I$3:$I$34)/1000,0))","v":"Maurice van Berkel"},{"$f":"INDEX(DATA!$H$3:$H$34,MATCH(LARGE((DATA!$I$3:$I$34)+ROW(DATA!$I$3:$I$34)/1000,ROW()-ROW($G$2)+1),(DATA!$I$3:$I$34)+ROW(DATA!$I$3:$I$34)/1000,0))","v":18},{"$f":"LARGE(DATA!$I$3:$I$34,ROW()-ROW($G$2)+1)","v":30}]
[{"$f":"INDEX(Scoreblad!$B$12:$B$43,MATCH(LARGE((Scoreblad!$D$12:$D$43)+ROW(Scoreblad!$D$12:$D$43)/1000,ROW()-ROW($A$2)+1),(Scoreblad!$D$12:$D$43)+ROW(Scoreblad!$D$12:$D$43)/1000,0))","v":"Jan Bierbooms"},{"$f":"INDEX(Scoreblad!$C$12:$C$43,MATCH(LARGE((Scoreblad!$D$12:$D$43)+ROW(Scoreblad!$D$12:$D$43)/1000,ROW()-ROW($A$2)+1),(Scoreblad!$D$12:$D$43)+ROW(Scoreblad!$D$12:$D$43)/1000,0))","v":25},{"$f":"LARGE(Scoreblad!$D$12:$D$43,ROW()-ROW($A$2)+1)","v":25.88},null,null,null,{"$f":"INDEX(DATA!$G$3:$G$34,MATCH(LARGE((DATA!$I$3:$I$34)+ROW(DATA!$I$3:$I$34)/1000,ROW()-ROW($G$2)+1),(DATA!$I$3:$I$34)+ROW(DATA!$I$3:$I$34)/1000,0))","v":"Maarten Kaas"},{"$f":"INDEX(DATA!$H$3:$H$34,MATCH(LARGE((DATA!$I$3:$I$34)+ROW(DATA!$I$3:$I$34)/1000,ROW()-ROW($G$2)+1),(DATA!$I$3:$I$34)+ROW(DATA!$I$3:$I$34)/1000,0))","v":18},{"$f":"LARGE(DATA!$I$3:$I$34,ROW()-ROW($G$2)+1)","v":30}]
[{"$f":"INDEX(Scoreblad!$B$12:$B$43,MATCH(LARGE((Scoreblad!$D$12:$D$43)+ROW(Scoreblad!$D$12:$D$43)/1000,ROW()-ROW($A$2)+1),(Scoreblad!$D$12:$D$43)+ROW(Scoreblad!$D$12:$D$43)/1000,0))","v":"Boudewijn v/d Plas"},{"$f":"INDEX(Scoreblad!$C$12:$C$43,MATCH(LARGE((Scoreblad!$D$12:$D$43)+ROW(Scoreblad!$D$12:$D$43)/1000,ROW()-ROW($A$2)+1),(Scoreblad!$D$12:$D$43)+ROW(Scoreblad!$D$12:$D$43)/1000,0))","v":21},{"$f":"LARGE(Scoreblad!$D$12:$D$43,ROW()-ROW($A$2)+1)","v":25.476190476190474},null,null,null,{"$f":"INDEX(DATA!$G$3:$G$34,MATCH(LARGE((DATA!$I$3:$I$34)+ROW(DATA!$I$3:$I$34)/1000,ROW()-ROW($G$2)+1),(DATA!$I$3:$I$34)+ROW(DATA!$I$3:$I$34)/1000,0))","v":"Jan Hoogstrate"},{"$f":"INDEX(DATA!$H$3:$H$34,MATCH(LARGE((DATA!$I$3:$I$34)+ROW(DATA!$I$3:$I$34)/1000,ROW()-ROW($G$2)+1),(DATA!$I$3:$I$34)+ROW(DATA!$I$3:$I$34)/1000,0))","v":18},{"$f":"LARGE(DATA!$I$3:$I$34,ROW()-ROW($G$2)+1)","v":30}]
[{"$f":"INDEX(Scoreblad!$B$12:$B$43,MATCH(LARGE((Scoreblad!$D$12:$D$43)+ROW(Scoreblad!$D$12:$D$43)/1000,ROW()-ROW($A$2)+1),(Scoreblad!$D$12:$D$43)+ROW(Scoreblad!$D$12:$D$43)/1000,0))","v":"Richard Smits"},{"$f":"INDEX(Scoreblad!$C$12:$C$43,MATCH(LARGE((Scoreblad!$D$12:$D$43)+ROW(Scoreblad!$D$12:$D$43)/1000,ROW()-ROW($A$2)+1),(Scoreblad!$D$12:$D$43)+ROW(Scoreblad!$D$12:$D$43)/1000,0))","v":20},{"$f":"LARGE(Scoreblad!$D$12:$D$43,ROW()-ROW($A$2)+1)","v":25.4},null,null,null,{"$f":"INDEX(DATA!$G$3:$G$34,MATCH(LARGE((DATA!$I$3:$I$34)+ROW(DATA!$I$3:$I$34)/1000,ROW()-ROW($G$2)+1),(DATA!$I$3:$I$34)+ROW(DATA!$I$3:$I$34)/1000,0))","v":"Dre Verhoef"},{"$f":"INDEX(DATA!$H$3:$H$34,MATCH(LARGE((DATA!$I$3:$I$34)+ROW(DATA!$I$3:$I$34)/1000,ROW()-ROW($G$2)+1),(DATA!$I$3:$I$34)+ROW(DATA!$I$3:$I$34)/1000,0))","v":18},{"$f":"LARGE(DATA!$I$3:$I$34,ROW()-ROW($G$2)+1)","v":30}]
[{"$f":"INDEX(Scoreblad!$B$12:$B$43,MATCH(LARGE((Scoreblad!$D$12:$D$43)+ROW(Scoreblad!$D$12:$D$43)/1000,ROW()-ROW($A$2)+1),(Scoreblad!$D$12:$D$43)+ROW(Scoreblad!$D$12:$D$43)/1000,0))","v":"Tonnie Breeweg"},{"$f":"INDEX(Scoreblad!$C$12:$C$43,MATCH(LARGE((Scoreblad!$D$12:$D$43)+ROW(Scoreblad!$D$12:$D$43)/1000,ROW()-ROW($A$2)+1),(Scoreblad!$D$12:$D$43)+ROW(Scoreblad!$D$12:$D$43)/1000,0))","v":21},{"$f":"LARGE(Scoreblad!$D$12:$D$43,ROW()-ROW($A$2)+1)","v":25.238095238095237},null,null,null,{"$f":"INDEX(DATA!$G$3:$G$34,MATCH(LARGE((DATA!$I$3:$I$34)+ROW(DATA!$I$3:$I$34)/1000,ROW()-ROW($G$2)+1),(DATA!$I$3:$I$34)+ROW(DATA!$I$3:$I$34)/1000,0))","v":"Boudewijn v/d Plas"},{"$f":"INDEX(DATA!$H$3:$H$34,MATCH(LARGE((DATA!$I$3:$I$34)+ROW(DATA!$I$3:$I$34)/1000,ROW()-ROW($G$2)+1),(DATA!$I$3:$I$34)+ROW(DATA!$I$3:$I$34)/1000,0))","v":18},{"$f":"LARGE(DATA!$I$3:$I$34,ROW()-ROW($G$2)+1)","v":30}]
[{"$f":"INDEX(Scoreblad!$B$12:$B$43,MATCH(LARGE((Scoreblad!$D$12:$D$43)+ROW(Scoreblad!$D$12:$D$43)/1000,ROW()-ROW($A$2)+1),(Scoreblad!$D$12:$D$43)+ROW(Scoreblad!$D$12:$D$43)/1000,0))","v":"Bart de Bot"},{"$f":"INDEX(Scoreblad!$C$12:$C$43,MATCH(LARGE((Scoreblad!$D$12:$D$43)+ROW(Scoreblad!$D$12:$D$43)/1000,ROW()-ROW($A$2)+1),(Scoreblad!$D$12:$D$43)+ROW(Scoreblad!$D$12:$D$43)/1000,0))","v":24},{"$f":"LARGE(Scoreblad!$D$12:$D$43,ROW()-ROW($A$2)+1)","v":25.125},null,null,null,{"$f":"INDEX(DATA!$G$3:$G$34,MATCH(LARGE((DATA!$I$3:$I$34)+ROW(DATA!$I$3:$I$34)/1000,ROW()-ROW($G$2)+1),(DATA!$I$3:$I$34)+ROW(DATA!$I$3:$I$34)/1000,0))","v":"Wally Gijzen"},{"$f":"INDEX(DATA!$H$3:$H$34,MATCH(LARGE((DATA!$I$3:$I$34)+ROW(DATA!$I$3:$I$34)/1000,ROW()-ROW($G$2)+1),(DATA!$I$3:$I$34)+ROW(DATA!$I$3:$I$34)/1000,0))","v":17},{"$f":"LARGE(DATA!$I$3:$I$34,ROW()-ROW($G$2)+1)","v":23}]
[{"$f":"INDEX(Scoreblad!$B$12:$B$43,MATCH(LARGE((Scoreblad!$D$12:$D$43)+ROW(Scoreblad!$D$12:$D$43)/1000,ROW()-ROW($A$2)+1),(Scoreblad!$D$12:$D$43)+ROW(Scoreblad!$D$12:$D$43)/1000,0))","v":"Maarten Kaas"},{"$f":"INDEX(Scoreblad!$C$12:$C$43,MATCH(LARGE((Scoreblad!$D$12:$D$43)+ROW(Scoreblad!$D$12:$D$43)/1000,ROW()-ROW($A$2)+1),(Scoreblad!$D$12:$D$43)+ROW(Scoreblad!$D$12:$D$43)/1000,0))","v":19},{"$f":"LARGE(Scoreblad!$D$12:$D$43,ROW()-ROW($A$2)+1)","v":24.526315789473685},null,null,null,{"$f":"INDEX(DATA!$G$3:$G$34,MATCH(LARGE((DATA!$I$3:$I$34)+ROW(DATA!$I$3:$I$34)/1000,ROW()-ROW($G$2)+1),(DATA!$I$3:$I$34)+ROW(DATA!$I$3:$I$34)/1000,0))","v":"Anthony Laros"},{"$f":"INDEX(DATA!$H$3:$H$34,MATCH(LARGE((DATA!$I$3:$I$34)+ROW(DATA!$I$3:$I$34)/1000,ROW()-ROW($G$2)+1),(DATA!$I$3:$I$34)+ROW(DATA!$I$3:$I$34)/1000,0))","v":17},{"$f":"LARGE(DATA!$I$3:$I$34,ROW()-ROW($G$2)+1)","v":23}]
[{"$f":"INDEX(Scoreblad!$B$12:$B$43,MATCH(LARGE((Scoreblad!$D$12:$D$43)+ROW(Scoreblad!$D$12:$D$43)/1000,ROW()-ROW($A$2)+1),(Scoreblad!$D$12:$D$43)+ROW(Scoreblad!$D$12:$D$43)/1000,0))","v":"Ronald Mekes"},{"$f":"INDEX(Scoreblad!$C$12:$C$43,MATCH(LARGE((Scoreblad!$D$12:$D$43)+ROW(Scoreblad!$D$12:$D$43)/1000,ROW()-ROW($A$2)+1),(Scoreblad!$D$12:$D$43)+ROW(Scoreblad!$D$12:$D$43)/1000,0))","v":17},{"$f":"LARGE(Scoreblad!$D$12:$D$43,ROW()-ROW($A$2)+1)","v":24.470588235294116},null,null,null,{"$f":"INDEX(DATA!$G$3:$G$34,MATCH(LARGE((DATA!$I$3:$I$34)+ROW(DATA!$I$3:$I$34)/1000,ROW()-ROW($G$2)+1),(DATA!$I$3:$I$34)+ROW(DATA!$I$3:$I$34)/1000,0))","v":"Walter Cats"},{"$f":"INDEX(DATA!$H$3:$H$34,MATCH(LARGE((DATA!$I$3:$I$34)+ROW(DATA!$I$3:$I$34)/1000,ROW()-ROW($G$2)+1),(DATA!$I$3:$I$34)+ROW(DATA!$I$3:$I$34)/1000,0))","v":16},{"$f":"LARGE(DATA!$I$3:$I$34,ROW()-ROW($G$2)+1)","v":21}]
[{"$f":"INDEX(Scoreblad!$B$12:$B$43,MATCH(LARGE((Scoreblad!$D$12:$D$43)+ROW(Scoreblad!$D$12:$D$43)/1000,ROW()-ROW($A$2)+1),(Scoreblad!$D$12:$D$43)+ROW(Scoreblad!$D$12:$D$43)/1000,0))","v":"Guust v/d Bemd"},{"$f":"INDEX(Scoreblad!$C$12:$C$43,MATCH(LARGE((Scoreblad!$D$12:$D$43)+ROW(Scoreblad!$D$12:$D$43)/1000,ROW()-ROW($A$2)+1),(Scoreblad!$D$12:$D$43)+ROW(Scoreblad!$D$12:$D$43)/1000,0))","v":26},{"$f":"LARGE(Scoreblad!$D$12:$D$43,ROW()-ROW($A$2)+1)","v":24.23076923076923},null,null,null,{"$f":"INDEX(DATA!$G$3:$G$34,MATCH(LARGE((DATA!$I$3:$I$34)+ROW(DATA!$I$3:$I$34)/1000,ROW()-ROW($G$2)+1),(DATA!$I$3:$I$34)+ROW(DATA!$I$3:$I$34)/1000,0))","v":"PJ de Bot"},{"$f":"INDEX(DATA!$H$3:$H$34,MATCH(LARGE((DATA!$I$3:$I$34)+ROW(DATA!$I$3:$I$34)/1000,ROW()-ROW($G$2)+1),(DATA!$I$3:$I$34)+ROW(DATA!$I$3:$I$34)/1000,0))","v":16},{"$f":"LARGE(DATA!$I$3:$I$34,ROW()-ROW($G$2)+1)","v":21}]
[{"$f":"INDEX(Scoreblad!$B$12:$B$43,MATCH(LARGE((Scoreblad!$D$12:$D$43)+ROW(Scoreblad!$D$12:$D$43)/1000,ROW()-ROW($A$2)+1),(Scoreblad!$D$12:$D$43)+ROW(Scoreblad!$D$12:$D$43)/1000,0))","v":"Jos Bergmans"},{"$f":"INDEX(Scoreblad!$C$12:$C$43,MATCH(LARGE((Scoreblad!$D$12:$D$43)+ROW(Scoreblad!$D$12:$D$43)/1000,ROW()-ROW($A$2)+1),(Scoreblad!$D$12:$D$43)+ROW(Scoreblad!$D$12:$D$43)/1000,0))","v":16},{"$f":"LARGE(Scoreblad!$D$12:$D$43,ROW()-ROW($A$2)+1)","v":24.0625},null,null,null,{"$f":"INDEX(DATA!$G$3:$G$34,MATCH(LARGE((DATA!$I$3:$I$34)+ROW(DATA!$I$3:$I$34)/1000,ROW()-ROW($G$2)+1),(DATA!$I$3:$I$34)+ROW(DATA!$I$3:$I$34)/1000,0))","v":"Pieter de Bot"},{"$f":"INDEX(DATA!$H$3:$H$34,MATCH(LARGE((DATA!$I$3:$I$34)+ROW(DATA!$I$3:$I$34)/1000,ROW()-ROW($G$2)+1),(DATA!$I$3:$I$34)+ROW(DATA!$I$3:$I$34)/1000,0))","v":16},{"$f":"LARGE(DATA!$I$3:$I$34,ROW()-ROW($G$2)+1)","v":21}]
[{"$f":"INDEX(Scoreblad!$B$12:$B$43,MATCH(LARGE((Scoreblad!$D$12:$D$43)+ROW(Scoreblad!$D$12:$D$43)/1000,ROW()-ROW($A$2)+1),(Scoreblad!$D$12:$D$43)+ROW(Scoreblad!$D$12:$D$43)/1000,0))","v":"Maurice van Berkel"},{"$f":"INDEX(Scoreblad!$C$12:$C$43,MATCH(LARGE((Scoreblad!$D$12:$D$43)+ROW(Scoreblad!$D$12:$D$43)/1000,ROW()-ROW($A$2)+1),(Scoreblad!$D$12:$D$43)+ROW(Scoreblad!$D$12:$D$43)/1000,0))","v":17},{"$f":"LARGE(Scoreblad!$D$12:$D$43,ROW()-ROW($A$2)+1)","v":24.058823529411764},null,null,null,{"$f":"INDEX(DATA!$G$3:$G$34,MATCH(LARGE((DATA!$I$3:$I$34)+ROW(DATA!$I$3:$I$34)/1000,ROW()-ROW($G$2)+1),(DATA!$I$3:$I$34)+ROW(DATA!$I$3:$I$34)/1000,0))","v":"Jan Bierbooms"},{"$f":"INDEX(DATA!$H$3:$H$34,MATCH(LARGE((DATA!$I$3:$I$34)+ROW(DATA!$I$3:$I$34)/1000,ROW()-ROW($G$2)+1),(DATA!$I$3:$I$34)+ROW(DATA!$I$3:$I$34)/1000,0))","v":16},{"$f":"LARGE(DATA!$I$3:$I$34,ROW()-ROW($G$2)+1)","v":21}]
[{"$f":"INDEX(Scoreblad!$B$12:$B$43,MATCH(LARGE((Scoreblad!$D$12:$D$43)+ROW(Scoreblad!$D$12:$D$43)/1000,ROW()-ROW($A$2)+1),(Scoreblad!$D$12:$D$43)+ROW(Scoreblad!$D$12:$D$43)/1000,0))","v":"Dre Verhoef"},{"$f":"INDEX(Scoreblad!$C$12:$C$43,MATCH(LARGE((Scoreblad!$D$12:$D$43)+ROW(Scoreblad!$D$12:$D$43)/1000,ROW()-ROW($A$2)+1),(Scoreblad!$D$12:$D$43)+ROW(Scoreblad!$D$12:$D$43)/1000,0))","v":19},{"$f":"LARGE(Scoreblad!$D$12:$D$43,ROW()-ROW($A$2)+1)","v":24.05263157894737},null,null,null,{"$f":"INDEX(DATA!$G$3:$G$34,MATCH(LARGE((DATA!$I$3:$I$34)+ROW(DATA!$I$3:$I$34)/1000,ROW()-ROW($G$2)+1),(DATA!$I$3:$I$34)+ROW(DATA!$I$3:$I$34)/1000,0))","v":"Wappie Broermann"},{"$f":"INDEX(DATA!$H$3:$H$34,MATCH(LARGE((DATA!$I$3:$I$34)+ROW(DATA!$I$3:$I$34)/1000,ROW()-ROW($G$2)+1),(DATA!$I$3:$I$34)+ROW(DATA!$I$3:$I$34)/1000,0))","v":14},{"$f":"LARGE(DATA!$I$3:$I$34,ROW()-ROW($G$2)+1)","v":17}]
[{"$f":"INDEX(Scoreblad!$B$12:$B$43,MATCH(LARGE((Scoreblad!$D$12:$D$43)+ROW(Scoreblad!$D$12:$D$43)/1000,ROW()-ROW($A$2)+1),(Scoreblad!$D$12:$D$43)+ROW(Scoreblad!$D$12:$D$43)/1000,0))","v":"Jeroen Mulder"},{"$f":"INDEX(Scoreblad!$C$12:$C$43,MATCH(LARGE((Scoreblad!$D$12:$D$43)+ROW(Scoreblad!$D$12:$D$43)/1000,ROW()-ROW($A$2)+1),(Scoreblad!$D$12:$D$43)+ROW(Scoreblad!$D$12:$D$43)/1000,0))","v":23},{"$f":"LARGE(Scoreblad!$D$12:$D$43,ROW()-ROW($A$2)+1)","v":24.043478260869566},null,null,null,{"$f":"INDEX(DATA!$G$3:$G$34,MATCH(LARGE((DATA!$I$3:$I$34)+ROW(DATA!$I$3:$I$34)/1000,ROW()-ROW($G$2)+1),(DATA!$I$3:$I$34)+ROW(DATA!$I$3:$I$34)/1000,0))","v":"JP Kolthof"},{"$f":"INDEX(DATA!$H$3:$H$34,MATCH(LARGE((DATA!$I$3:$I$34)+ROW(DATA!$I$3:$I$34)/1000,ROW()-ROW($G$2)+1),(DATA!$I$3:$I$34)+ROW(DATA!$I$3:$I$34)/1000,0))","v":14},{"$f":"LARGE(DATA!$I$3:$I$34,ROW()-ROW($G$2)+1)","v":17}]
[{"$f":"INDEX(Scoreblad!$B$12:$B$43,MATCH(LARGE((Scoreblad!$D$12:$D$43)+ROW(Scoreblad!$D$12:$D$43)/1000,ROW()-ROW($A$2)+1),(Scoreblad!$D$12:$D$43)+ROW(Scoreblad!$D$12:$D$43)/1000,0))","v":"JP Kolthof"},{"$f":"INDEX(Scoreblad!$C$12:$C$43,MATCH(LARGE((Scoreblad!$D$12:$D$43)+ROW(Scoreblad!$D$12:$D$43)/1000,ROW()-ROW($A$2)+1),(Scoreblad!$D$12:$D$43)+ROW(Scoreblad!$D$12:$D$43)/1000,0))","v":21},{"$f":"LARGE(Scoreblad!$D$12:$D$43,ROW()-ROW($A$2)+1)","v":23.61904761904762},null,null,null,{"$f":"INDEX(DATA!$G$3:$G$34,MATCH(LARGE((DATA!$I$3:$I$34)+ROW(DATA!$I$3:$I$34)/1000,ROW()-ROW($G$2)+1),(DATA!$I$3:$I$34)+ROW(DATA!$I$3:$I$34)/1000,0))","v":"Jeroen Mulder"},{"$f":"INDEX(DATA!$H$3:$H$34,MATCH(LARGE((DATA!$I$3:$I$34)+ROW(DATA!$I$3:$I$34)/1000,ROW()-ROW($G$2)+1),(DATA!$I$3:$I$34)+ROW(DATA!$I$3:$I$34)/1000,0))","v":14},{"$f":"LARGE(DATA!$I$3:$I$34,ROW()-ROW($G$2)+1)","v":17}]
[{"$f":"INDEX(Scoreblad!$B$12:$B$43,MATCH(LARGE((Scoreblad!$D$12:$D$43)+ROW(Scoreblad!$D$12:$D$43)/1000,ROW()-ROW($A$2)+1),(Scoreblad!$D$12:$D$43)+ROW(Scoreblad!$D$12:$D$43)/1000,0))","v":"Wappie Broermann"},{"$f":"INDEX(Scoreblad!$C$12:$C$43,MATCH(LARGE((Scoreblad!$D$12:$D$43)+ROW(Scoreblad!$D$12:$D$43)/1000,ROW()-ROW($A$2)+1),(Scoreblad!$D$12:$D$43)+ROW(Scoreblad!$D$12:$D$43)/1000,0))","v":12},{"$f":"LARGE(Scoreblad!$D$12:$D$43,ROW()-ROW($A$2)+1)","v":23.083333333333332},null,null,null,{"$f":"INDEX(DATA!$G$3:$G$34,MATCH(LARGE((DATA!$I$3:$I$34)+ROW(DATA!$I$3:$I$34)/1000,ROW()-ROW($G$2)+1),(DATA!$I$3:$I$34)+ROW(DATA!$I$3:$I$34)/1000,0))","v":"Pascal Mouthaan"},{"$f":"INDEX(DATA!$H$3:$H$34,MATCH(LARGE((DATA!$I$3:$I$34)+ROW(DATA!$I$3:$I$34)/1000,ROW()-ROW($G$2)+1),(DATA!$I$3:$I$34)+ROW(DATA!$I$3:$I$34)/1000,0))","v":13},{"$f":"LARGE(DATA!$I$3:$I$34,ROW()-ROW($G$2)+1)","v":14}]
[{"$f":"INDEX(Scoreblad!$B$12:$B$43,MATCH(LARGE((Scoreblad!$D$12:$D$43)+ROW(Scoreblad!$D$12:$D$43)/1000,ROW()-ROW($A$2)+1),(Scoreblad!$D$12:$D$43)+ROW(Scoreblad!$D$12:$D$43)/1000,0))","v":"Wally Gijzen"},{"$f":"INDEX(Scoreblad!$C$12:$C$43,MATCH(LARGE((Scoreblad!$D$12:$D$43)+ROW(Scoreblad!$D$12:$D$43)/1000,ROW()-ROW($A$2)+1),(Scoreblad!$D$12:$D$43)+ROW(Scoreblad!$D$12:$D$43)/1000,0))","v":21},{"$f":"LARGE(Scoreblad!$D$12:$D$43,ROW()-ROW($A$2)+1)","v":23.047619047619047},null,null,null,{"$f":"INDEX(DATA!$G$3:$G$34,MATCH(LARGE((DATA!$I$3:$I$34)+ROW(DATA!$I$3:$I$34)/1000,ROW()-ROW($G$2)+1),(DATA!$I$3:$I$34)+ROW(DATA!$I$3:$I$34)/1000,0))","v":"Wilco van den Oever"},{"$f":"INDEX(DATA!$H$3:$H$34,MATCH(LARGE((DATA!$I$3:$I$34)+ROW(DATA!$I$3:$I$34)/1000,ROW()-ROW($G$2)+1),(DATA!$I$3:$I$34)+ROW(DATA!$I$3:$I$34)/1000,0))","v":12},{"$f":"LARGE(DATA!$I$3:$I$34,ROW()-ROW($G$2)+1)","v":13}]
[{"$f":"INDEX(Scoreblad!$B$12:$B$43,MATCH(LARGE((Scoreblad!$D$12:$D$43)+ROW(Scoreblad!$D$12:$D$43)/1000,ROW()-ROW($A$2)+1),(Scoreblad!$D$12:$D$43)+ROW(Scoreblad!$D$12:$D$43)/1000,0))","v":"PJ de Bot"},{"$f":"INDEX(Scoreblad!$C$12:$C$43,MATCH(LARGE((Scoreblad!$D$12:$D$43)+ROW(Scoreblad!$D$12:$D$43)/1000,ROW()-ROW($A$2)+1),(Scoreblad!$D$12:$D$43)+ROW(Scoreblad!$D$12:$D$43)/1000,0))","v":27},{"$f":"LARGE(Scoreblad!$D$12:$D$43,ROW()-ROW($A$2)+1)","v":23},null,null,null,{"$f":"INDEX(DATA!$G$3:$G$34,MATCH(LARGE((DATA!$I$3:$I$34)+ROW(DATA!$I$3:$I$34)/1000,ROW()-ROW($G$2)+1),(DATA!$I$3:$I$34)+ROW(DATA!$I$3:$I$34)/1000,0))","v":"Sier van den Brand"},{"$f":"INDEX(DATA!$H$3:$H$34,MATCH(LARGE((DATA!$I$3:$I$34)+ROW(DATA!$I$3:$I$34)/1000,ROW()-ROW($G$2)+1),(DATA!$I$3:$I$34)+ROW(DATA!$I$3:$I$34)/1000,0))","v":12},{"$f":"LARGE(DATA!$I$3:$I$34,ROW()-ROW($G$2)+1)","v":13}]
[{"$f":"INDEX(Scoreblad!$B$12:$B$43,MATCH(LARGE((Scoreblad!$D$12:$D$43)+ROW(Scoreblad!$D$12:$D$43)/1000,ROW()-ROW($A$2)+1),(Scoreblad!$D$12:$D$43)+ROW(Scoreblad!$D$12:$D$43)/1000,0))","v":"Arthur Hopstaken"},{"$f":"INDEX(Scoreblad!$C$12:$C$43,MATCH(LARGE((Scoreblad!$D$12:$D$43)+ROW(Scoreblad!$D$12:$D$43)/1000,ROW()-ROW($A$2)+1),(Scoreblad!$D$12:$D$43)+ROW(Scoreblad!$D$12:$D$43)/1000,0))","v":12},{"$f":"LARGE(Scoreblad!$D$12:$D$43,ROW()-ROW($A$2)+1)","v":23},null,null,null,{"$f":"INDEX(DATA!$G$3:$G$34,MATCH(LARGE((DATA!$I$3:$I$34)+ROW(DATA!$I$3:$I$34)/1000,ROW()-ROW($G$2)+1),(DATA!$I$3:$I$34)+ROW(DATA!$I$3:$I$34)/1000,0))","v":"Ronald Mekes"},{"$f":"INDEX(DATA!$H$3:$H$34,MATCH(LARGE((DATA!$I$3:$I$34)+ROW(DATA!$I$3:$I$34)/1000,ROW()-ROW($G$2)+1),(DATA!$I$3:$I$34)+ROW(DATA!$I$3:$I$34)/1000,0))","v":11},{"$f":"LARGE(DATA!$I$3:$I$34,ROW()-ROW($G$2)+1)","v":11}]
[{"$f":"INDEX(Scoreblad!$B$12:$B$43,MATCH(LARGE((Scoreblad!$D$12:$D$43)+ROW(Scoreblad!$D$12:$D$43)/1000,ROW()-ROW($A$2)+1),(Scoreblad!$D$12:$D$43)+ROW(Scoreblad!$D$12:$D$43)/1000,0))","v":"Wilco van den Oever"},{"$f":"INDEX(Scoreblad!$C$12:$C$43,MATCH(LARGE((Scoreblad!$D$12:$D$43)+ROW(Scoreblad!$D$12:$D$43)/1000,ROW()-ROW($A$2)+1),(Scoreblad!$D$12:$D$43)+ROW(Scoreblad!$D$12:$D$43)/1000,0))","v":23},{"$f":"LARGE(Scoreblad!$D$12:$D$43,ROW()-ROW($A$2)+1)","v":22.869565217391305},null,null,null,{"$f":"INDEX(DATA!$G$3:$G$34,MATCH(LARGE((DATA!$I$3:$I$34)+ROW(DATA!$I$3:$I$34)/1000,ROW()-ROW($G$2)+1),(DATA!$I$3:$I$34)+ROW(DATA!$I$3:$I$34)/1000,0))","v":"Bart de Bot"},{"$f":"INDEX(DATA!$H$3:$H$34,MATCH(LARGE((DATA!$I$3:$I$34)+ROW(DATA!$I$3:$I$34)/1000,ROW()-ROW($G$2)+1),(DATA!$I$3:$I$34)+ROW(DATA!$I$3:$I$34)/1000,0))","v":10},{"$f":"LARGE(DATA!$I$3:$I$34,ROW()-ROW($G$2)+1)","v":10}]
[{"$f":"INDEX(Scoreblad!$B$12:$B$43,MATCH(LARGE((Scoreblad!$D$12:$D$43)+ROW(Scoreblad!$D$12:$D$43)/1000,ROW()-ROW($A$2)+1),(Scoreblad!$D$12:$D$43)+ROW(Scoreblad!$D$12:$D$43)/1000,0))","v":"Anthony Laros"},{"$f":"INDEX(Scoreblad!$C$12:$C$43,MATCH(LARGE((Scoreblad!$D$12:$D$43)+ROW(Scoreblad!$D$12:$D$43)/1000,ROW()-ROW($A$2)+1),(Scoreblad!$D$12:$D$43)+ROW(Scoreblad!$D$12:$D$43)/1000,0))","v":15},{"$f":"LARGE(Scoreblad!$D$12:$D$43,ROW()-ROW($A$2)+1)","v":22.133333333333333},null,null,null,{"$f":"INDEX(DATA!$G$3:$G$34,MATCH(LARGE((DATA!$I$3:$I$34)+ROW(DATA!$I$3:$I$34)/1000,ROW()-ROW($G$2)+1),(DATA!$I$3:$I$34)+ROW(DATA!$I$3:$I$34)/1000,0))","v":"Eddy vd Tuijn"},{"$f":"INDEX(DATA!$H$3:$H$34,MATCH(LARGE((DATA!$I$3:$I$34)+ROW(DATA!$I$3:$I$34)/1000,ROW()-ROW($G$2)+1),(DATA!$I$3:$I$34)+ROW(DATA!$I$3:$I$34)/1000,0))","v":9},{"$f":"LARGE(DATA!$I$3:$I$34,ROW()-ROW($G$2)+1)","v":9}]
[{"$f":"INDEX(Scoreblad!$B$12:$B$43,MATCH(LARGE((Scoreblad!$D$12:$D$43)+ROW(Scoreblad!$D$12:$D$43)/1000,ROW()-ROW($A$2)+1),(Scoreblad!$D$12:$D$43)+ROW(Scoreblad!$D$12:$D$43)/1000,0))","v":"Patrick Laros"},{"$f":"INDEX(Scoreblad!$C$12:$C$43,MATCH(LARGE((Scoreblad!$D$12:$D$43)+ROW(Scoreblad!$D$12:$D$43)/1000,ROW()-ROW($A$2)+1),(Scoreblad!$D$12:$D$43)+ROW(Scoreblad!$D$12:$D$43)/1000,0))","v":14},{"$f":"LARGE(Scoreblad!$D$12:$D$43,ROW()-ROW($A$2)+1)","v":22.071428571428573},null,null,null,{"$f":"INDEX(DATA!$G$3:$G$34,MATCH(LARGE((DATA!$I$3:$I$34)+ROW(DATA!$I$3:$I$34)/1000,ROW()-ROW($G$2)+1),(DATA!$I$3:$I$34)+ROW(DATA!$I$3:$I$34)/1000,0))","v":"Toon Melisse"},{"$f":"INDEX(DATA!$H$3:$H$34,MATCH(LARGE((DATA!$I$3:$I$34)+ROW(DATA!$I$3:$I$34)/1000,ROW()-ROW($G$2)+1),(DATA!$I$3:$I$34)+ROW(DATA!$I$3:$I$34)/1000,0))","v":0},{"$f":"LARGE(DATA!$I$3:$I$34,ROW()-ROW($G$2)+1)","v":0}]
[{"$f":"INDEX(Scoreblad!$B$12:$B$43,MATCH(LARGE((Scoreblad!$D$12:$D$43)+ROW(Scoreblad!$D$12:$D$43)/1000,ROW()-ROW($A$2)+1),(Scoreblad!$D$12:$D$43)+ROW(Scoreblad!$D$12:$D$43)/1000,0))","v":"Sier van den Brand"},{"$f":"INDEX(Scoreblad!$C$12:$C$43,MATCH(LARGE((Scoreblad!$D$12:$D$43)+ROW(Scoreblad!$D$12:$D$43)/1000,ROW()-ROW($A$2)+1),(Scoreblad!$D$12:$D$43)+ROW(Scoreblad!$D$12:$D$43)/1000,0))","v":21},{"$f":"LARGE(Scoreblad!$D$12:$D$43,ROW()-ROW($A$2)+1)","v":22.047619047619047},null,null,null,{"$f":"INDEX(DATA!$G$3:$G$34,MATCH(LARGE((DATA!$I$3:$I$34)+ROW(DATA!$I$3:$I$34)/1000,ROW()-ROW($G$2)+1),(DATA!$I$3:$I$34)+ROW(DATA!$I$3:$I$34)/1000,0))","v":"Ringo Joannes"},{"$f":"INDEX(DATA!$H$3:$H$34,MATCH(LARGE((DATA!$I$3:$I$34)+ROW(DATA!$I$3:$I$34)/1000,ROW()-ROW($G$2)+1),(DATA!$I$3:$I$34)+ROW(DATA!$I$3:$I$34)/1000,0))","v":0},{"$f":"LARGE(DATA!$I$3:$I$34,ROW()-ROW($G$2)+1)","v":0}]
[{"$f":"INDEX(Scoreblad!$B$12:$B$43,MATCH(LARGE((Scoreblad!$D$12:$D$43)+ROW(Scoreblad!$D$12:$D$43)/1000,ROW()-ROW($A$2)+1),(Scoreblad!$D$12:$D$43)+ROW(Scoreblad!$D$12:$D$43)/1000,0))","v":"Pascal Mouthaan"},{"$f":"INDEX(Scoreblad!$C$12:$C$43,MATCH(LARGE((Scoreblad!$D$12:$D$43)+ROW(Scoreblad!$D$12:$D$43)/1000,ROW()-ROW($A$2)+1),(Scoreblad!$D$12:$D$43)+ROW(Scoreblad!$D$12:$D$43)/1000,0))","v":24},{"$f":"LARGE(Scoreblad!$D$12:$D$43,ROW()-ROW($A$2)+1)","v":21.75},null,null,null,{"$f":"INDEX(DATA!$G$3:$G$34,MATCH(LARGE((DATA!$I$3:$I$34)+ROW(DATA!$I$3:$I$34)/1000,ROW()-ROW($G$2)+1),(DATA!$I$3:$I$34)+ROW(DATA!$I$3:$I$34)/1000,0))","v":"Richard Smits"},{"$f":"INDEX(DATA!$H$3:$H$34,MATCH(LARGE((DATA!$I$3:$I$34)+ROW(DATA!$I$3:$I$34)/1000,ROW()-ROW($G$2)+1),(DATA!$I$3:$I$34)+ROW(DATA!$I$3:$I$34)/1000,0))","v":0},{"$f":"LARGE(DATA!$I$3:$I$34,ROW()-ROW($G$2)+1)","v":0}]
[{"$f":"INDEX(Scoreblad!$B$12:$B$43,MATCH(LARGE((Scoreblad!$D$12:$D$43)+ROW(Scoreblad!$D$12:$D$43)/1000,ROW()-ROW($A$2)+1),(Scoreblad!$D$12:$D$43)+ROW(Scoreblad!$D$12:$D$43)/1000,0))","v":"Toon Melisse"},{"$f":"INDEX(Scoreblad!$C$12:$C$43,MATCH(LARGE((Scoreblad!$D$12:$D$43)+ROW(Scoreblad!$D$12:$D$43)/1000,ROW()-ROW($A$2)+1),(Scoreblad!$D$12:$D$43)+ROW(Scoreblad!$D$12:$D$43)/1000,0))","v":14},{"$f":"LARGE(Scoreblad!$D$12:$D$43,ROW()-ROW($A$2)+1)","v":20.714285714285715},null,null,null,{"$f":"INDEX(DATA!$G$3:$G$34,MATCH(LARGE((DATA!$I$3:$I$34)+ROW(DATA!$I$3:$I$34)/1000,ROW()-ROW($G$2)+1),(DATA!$I$3:$I$34)+ROW(DATA!$I$3:$I$34)/1000,0))","v":"Patrick Laros"},{"$f":"INDEX(DATA!$H$3:$H$34,MATCH(LARGE((DATA!$I$3:$I$34)+ROW(DATA!$I$3:$I$34)/1000,ROW()-ROW($G$2)+1),(DATA!$I$3:$I$34)+ROW(DATA!$I$3:$I$34)/1000,0))","v":0},{"$f":"LARGE(DATA!$I$3:$I$34,ROW()-ROW($G$2)+1)","v":0}]
[{"$f":"INDEX(Scoreblad!$B$12:$B$43,MATCH(LARGE((Scoreblad!$D$12:$D$43)+ROW(Scoreblad!$D$12:$D$43)/1000,ROW()-ROW($A$2)+1),(Scoreblad!$D$12:$D$43)+ROW(Scoreblad!$D$12:$D$43)/1000,0))","v":"Eddy vd Tuijn"},{"$f":"INDEX(Scoreblad!$C$12:$C$43,MATCH(LARGE((Scoreblad!$D$12:$D$43)+ROW(Scoreblad!$D$12:$D$43)/1000,ROW()-ROW($A$2)+1),(Scoreblad!$D$12:$D$43)+ROW(Scoreblad!$D$12:$D$43)/1000,0))","v":22},{"$f":"LARGE(Scoreblad!$D$12:$D$43,ROW()-ROW($A$2)+1)","v":20.454545454545453},null,null,null,{"$f":"INDEX(DATA!$G$3:$G$34,MATCH(LARGE((DATA!$I$3:$I$34)+ROW(DATA!$I$3:$I$34)/1000,ROW()-ROW($G$2)+1),(DATA!$I$3:$I$34)+ROW(DATA!$I$3:$I$34)/1000,0))","v":"Michiel Vroon"},{"$f":"INDEX(DATA!$H$3:$H$34,MATCH(LARGE((DATA!$I$3:$I$34)+ROW(DATA!$I$3:$I$34)/1000,ROW()-ROW($G$2)+1),(DATA!$I$3:$I$34)+ROW(DATA!$I$3:$I$34)/1000,0))","v":0},{"$f":"LARGE(DATA!$I$3:$I$34,ROW()-ROW($G$2)+1)","v":0}]
[{"$f":"INDEX(Scoreblad!$B$12:$B$43,MATCH(LARGE((Scoreblad!$D$12:$D$43)+ROW(Scoreblad!$D$12:$D$43)/1000,ROW()-ROW($A$2)+1),(Scoreblad!$D$12:$D$43)+ROW(Scoreblad!$D$12:$D$43)/1000,0))","v":"Jef van Noort"},{"$f":"INDEX(Scoreblad!$C$12:$C$43,MATCH(LARGE((Scoreblad!$D$12:$D$43)+ROW(Scoreblad!$D$12:$D$43)/1000,ROW()-ROW($A$2)+1),(Scoreblad!$D$12:$D$43)+ROW(Scoreblad!$D$12:$D$43)/1000,0))","v":11},{"$f":"LARGE(Scoreblad!$D$12:$D$43,ROW()-ROW($A$2)+1)","v":19.363636363636363},null,null,null,{"$f":"INDEX(DATA!$G$3:$G$34,MATCH(LARGE((DATA!$I$3:$I$34)+ROW(DATA!$I$3:$I$34)/1000,ROW()-ROW($G$2)+1),(DATA!$I$3:$I$34)+ROW(DATA!$I$3:$I$34)/1000,0))","v":"Jef van Noort"},{"$f":"INDEX(DATA!$H$3:$H$34,MATCH(LARGE((DATA!$I$3:$I$34)+ROW(DATA!$I$3:$I$34)/1000,ROW()-ROW($G$2)+1),(DATA!$I$3:$I$34)+ROW(DATA!$I$3:$I$34)/1000,0))","v":0},{"$f":"LARGE(DATA!$I$3:$I$34,ROW()-ROW($G$2)+1)","v":0}]
[{"$f":"INDEX(Scoreblad!$B$12:$B$43,MATCH(LARGE((Scoreblad!$D$12:$D$43)+ROW(Scoreblad!$D$12:$D$43)/1000,ROW()-ROW($A$2)+1),(Scoreblad!$D$12:$D$43)+ROW(Scoreblad!$D$12:$D$43)/1000,0))","v":"Pieter de Bot"},{"$f":"INDEX(Scoreblad!$C$12:$C$43,MATCH(LARGE((Scoreblad!$D$12:$D$43)+ROW(Scoreblad!$D$12:$D$43)/1000,ROW()-ROW($A$2)+1),(Scoreblad!$D$12:$D$43)+ROW(Scoreblad!$D$12:$D$43)/1000,0))","v":14},{"$f":"LARGE(Scoreblad!$D$12:$D$43,ROW()-ROW($A$2)+1)","v":18},null,null,null,{"$f":"INDEX(DATA!$G$3:$G$34,MATCH(LARGE((DATA!$I$3:$I$34)+ROW(DATA!$I$3:$I$34)/1000,ROW()-ROW($G$2)+1),(DATA!$I$3:$I$34)+ROW(DATA!$I$3:$I$34)/1000,0))","v":"Daan vd Tuijn"},{"$f":"INDEX(DATA!$H$3:$H$34,MATCH(LARGE((DATA!$I$3:$I$34)+ROW(DATA!$I$3:$I$34)/1000,ROW()-ROW($G$2)+1),(DATA!$I$3:$I$34)+ROW(DATA!$I$3:$I$34)/1000,0))","v":0},{"$f":"LARGE(DATA!$I$3:$I$34,ROW()-ROW($G$2)+1)","v":0}]
[{"$f":"INDEX(Scoreblad!$B$12:$B$43,MATCH(LARGE((Scoreblad!$D$12:$D$43)+ROW(Scoreblad!$D$12:$D$43)/1000,ROW()-ROW($A$2)+1),(Scoreblad!$D$12:$D$43)+ROW(Scoreblad!$D$12:$D$43)/1000,0))","v":"Ringo Joannes"},{"$f":"INDEX(Scoreblad!$C$12:$C$43,MATCH(LARGE((Scoreblad!$D$12:$D$43)+ROW(Scoreblad!$D$12:$D$43)/1000,ROW()-ROW($A$2)+1),(Scoreblad!$D$12:$D$43)+ROW(Scoreblad!$D$12:$D$43)/1000,0))","v":11},{"$f":"LARGE(Scoreblad!$D$12:$D$43,ROW()-ROW($A$2)+1)","v":17},null,null,null,{"$f":"INDEX(DATA!$G$3:$G$34,MATCH(LARGE((DATA!$I$3:$I$34)+ROW(DATA!$I$3:$I$34)/1000,ROW()-ROW($G$2)+1),(DATA!$I$3:$I$34)+ROW(DATA!$I$3:$I$34)/1000,0))","v":"Arthur Hopstaken"},{"$f":"INDEX(DATA!$H$3:$H$34,MATCH(LARGE((DATA!$I$3:$I$34)+ROW(DATA!$I$3:$I$34)/1000,ROW()-ROW($G$2)+1),(DATA!$I$3:$I$34)+ROW(DATA!$I$3:$I$34)/1000,0))","v":0},{"$f":"LARGE(DATA!$I$3:$I$34,ROW()-ROW($G$2)+1)","v":0}]

{"sheet":"Blad7","index":1,"n_rows":35,"n_cols":3,"rows_kept":35,"cut":false,"hidden":true,"merged":[]}
[]
[]
[]
["Rijlabels","Som van Kolom5","Som van Kolom7"]
["Anthony Laros",5,5]
["Arthur Hopstaken",23,26]
["Bart de Bot",11,13]
["Daan vd Tuijn",19,19]
["Dre Verhoef",27,1]
["Eddy vd Tuijn",29,11]
["Guust v/d Bemd",23,26]
["Jan Bierbooms",14,19]
["Jan Hoogstrate",25,2]
["Jef van Noort",11,7]
["Jeroen Mulder",14,23]
["Jos Bergmans",19,3]
["JP Kolthof",23,23]
["Maurice van Berkel",1,19]
["Michiel Vroon",19,11]
["Pascal Mouthaan",19,9]
["Patrick Laros",27,8]
["Paul Nijmeijer",25,5]
["Pieter de Bot",6,23]
["PJ de Bot",5,30]
["Richard Smits",30,7]
["Ringo Joannes",5,28]
["Ronald Mekes",19,23]
["Sier van den Brand",5,29]
["Tonnie Breeweg",14,27]
["Toon Melisse",7,15]
["Wally Gijzen",11,12]
["Walter Cats",11,26]
["Wappie Broermann",29,19]
["Wilco van den Oever",20,15]
["Eindtotaal",496,484]

{"sheet":"Scoreblad","index":2,"n_rows":43,"n_cols":76,"rows_kept":43,"cut":false,"hidden":false,"merged":[[8,56,8,59],[8,52,8,55],[8,50,8,51],[8,28,8,29],[8,30,8,31],[8,32,8,33],[8,34,8,35],[8,36,8,37],[8,38,8,39],[8,40,8,41],[8,42,8,43],[8,44,8,45],[8,46,8,47],[8,48,8,49],[8,26,8,27],[8,4,8,5],[8,6,8,7],[8,8,8,9],[8,10,8,11],[8,12,8,13],[8,14,8,15],[8,16,8,17],[8,18,8,19],[8,20,8,21],[8,22,8,23],[8,24,8,25],[7,28,7,29],[7,30,7,31],[7,4,7,5],[7,6,7,7],[7,8,7,9],[7,10,7,11],[7,12,7,13],[7,14,7,15],[7,16,7,17],[7,18,7,19],[7,20,7,21],[7,22,7,23],[7,24,7,25],[7,26,7,27],[7,32,7,33],[7,34,7,35],[7,36,7,37],[7,38,7,39],[7,40,7,41],[7,42,7,43],[7,44,7,45],[7,46,7,47],[7,48,7,49],[7,50,7,51],[7,52,7,53],[7,54,7,55],[7,56,7,57],[7,68,7,69],[7,70,7,71],[7,58,7,59],[7,72,7,73],[7,74,7,75],[8,60,8,63],[7,60,7,61],[7,62,7,63],[7,64,7,65],[7,66,7,67],[8,74,8,75],[8,72,8,73],[8,64,8,65],[8,66,8,67],[8,68,8,69],[8,70,8,71]]}
[]
[]
[]
[]
[]
[]
[null,null,null,null,{"$f":"WEEKNUM(E9,1)&E10","v":"14Stb"},{"$f":"WEEKNUM(E9,1)&F10","v":"14Pnt"},{"$f":"WEEKNUM(G9,1)&G10","v":"15Stb"},{"$f":"WEEKNUM(G9,1)&H10","v":"15Pnt"},{"$f":"WEEKNUM(I9,1)&I10","v":"16Stb"},{"$f":"WEEKNUM(I9,1)&J10","v":"16Pnt"},{"$f":"WEEKNUM(K9,1)&K10","v":"17Stb"},{"$f":"WEEKNUM(K9,1)&L10","v":"17Pnt"},"18Stb","18Pnt","19Stb","19Pnt","20Stb","20Pnt","21Stb","21Pnt","22Stb","22Pnt","23Stb","23Pnt","24Stb","24Pnt","25Stb","25Pnt","26Stb","26Pnt","27Stb","27Pnt","28Stb","28Pnt","29Stb","29Pnt","30Stb","30Pnt","31Stb","31Pnt","32Stb","32Pnt","33Stb","33Pnt","34Stb","34Pnt","35Stb","35Pnt","36Stb","36Pnt","37Stb","37Pnt","38Stb","38Pnt","0Stb","0Pnt",{"$f":"BE8&BE10","v":"DATW3Stb"},{"$f":"BE8&BF10","v":"DATW3Pnt"},{"$f":"BG8&BG10","v":"DATW4Stb"},{"$f":"BG8&BH10","v":"DATW4Pnt"},{"$f":"BI8&BI10","v":"DATW5Stb"},{"$f":"BI8&BJ10","v":"DATW5Pnt"},{"$f":"BK8&BK10","v":"DATW6Stb"},{"$f":"BK8&BL10","v":"DATW6Pnt"},{"$f":"BM8&BM10","v":"39Stb"},{"$f":"BM8&BN10","v":"39Pnt"},{"$f":"BO8&BO10","v":"40Stb"},{"$f":"BO8&BP10","v":"40Pnt"},"41Stb","41Pnt","42Stb","42Pnt","43Stb","43Pnt","44Stb","44Pnt"]
[33,null,null,"Week",{"$f":"WEEKNUM(E9)","v":14},null,{"$f":"WEEKNUM(G9)","v":15},null,{"$f":"WEEKNUM(I9)","v":16},null,{"$f":"WEEKNUM(K9)","v":17},null,{"$f":"WEEKNUM(M9)","v":18},null,{"$f":"WEEKNUM(O9)","v":19},null,{"$f":"WEEKNUM(Q9)","v":20},null,{"$f":"WEEKNUM(S9)","v":21},null,{"$f":"WEEKNUM(U9)","v":22},null,{"$f":"WEEKNUM(W9)","v":23},null,{"$f":"WEEKNUM(Y9)","v":24},null,{"$f":"WEEKNUM(AA9)","v":25},null,{"$f":"WEEKNUM(AC9)","v":26},null,{"$f":"WEEKNUM(AE9)","v":27},null,{"$f":"WEEKNUM(AG9)","v":28},null,{"$f":"WEEKNUM(AI9)","v":29},null,{"$f":"WEEKNUM(AK9)","v":30},null,{"$f":"WEEKNUM(AM9)","v":31},null,{"$f":"WEEKNUM(AO9)","v":32},null,{"$f":"WEEKNUM(AQ9)","v":33},null,{"$f":"WEEKNUM(AS9)","v":34},null,{"$f":"WEEKNUM(AU9)","v":35},null,{"$f":"WEEKNUM(AW9)","v":36},null,{"$f":"WEEKNUM(AY9)","v":37},null,"DATW1",null,"DATW2",null,"DATW3",null,"DATW4",null,"DATW5",null,"DATW6",null,{"$f":"WEEKNUM(BM9)","v":39},null,40,null,{"$f":"WEEKNUM(BQ9)","v":41},null,{"$f":"WEEKNUM(BS9)","v":42},null,{"$f":"WEEKNUM(BU9)","v":43},null,{"$f":"WEEKNUM(BW9)","v":44}]
[null,null,null,"Datum","2021-04-01",null,{"$f":"E9+7","v":"2021-04-08"},null,{"$f":"G9+7","v":"2021-04-15"},null,{"$f":"I9+7","v":"2021-04-22"},null,{"$f":"K9+7","v":"2021-04-29"},null,{"$f":"M9+7","v":"2021-05-06"},null,{"$f":"O9+7","v":"2021-05-13"},null,{"$f":"Q9+7","v":"2021-05-20"},null,{"$f":"S9+7","v":"2021-05-27"},null,{"$f":"U9+7","v":"2021-06-03"},null,{"$f":"W9+7","v":"2021-06-10"},null,{"$f":"Y9+7","v":"2021-06-17"},null,{"$f":"AA9+7","v":"2021-06-24"},null,{"$f":"AC9+7","v":"2021-07-01"},null,{"$f":"AE9+7","v":"2021-07-08"},null,{"$f":"AG9+7","v":"2021-07-15"},null,{"$f":"AI9+7","v":"2021-07-22"},null,{"$f":"AK9+7","v":"2021-07-29"},null,{"$f":"AM9+7","v":"2021-08-05"},null,{"$f":"AO9+7","v":"2021-08-12"},null,{"$f":"AQ9+7","v":"2021-08-19"},null,{"$f":"AS9+7","v":"2021-08-26"},null,{"$f":"AU9+7","v":"2021-09-02"},null,{"$f":"AW9+7","v":"2021-09-09"},null,{"$f":"AY9+7","v":"2021-09-16"},null,null,null,"2019-09-17",null,null,null,{"$f":"BE9+1","v":"2019-09-18"},null,null,null,{"$f":"BA9+7","v":"2021-09-23"},null,{"$f":"BM9+7","v":"2021-09-30"},null,{"$f":"BO9+7","v":"2021-10-07"},null,{"$f":"BQ9+7","v":"2021-10-14"},null,{"$f":"BS9+7","v":"2021-10-21"},null,{"$f":"BU9+7","v":"2021-10-28"}]
[null,"Naam","Opkomsten","Gemiddelde","Stb","Pnt","Stb","Pnt","Stb","Pnt","Stb","Pnt","Stb","Pnt","Stb","Pnt","Stb","Pnt","Stb","Pnt","Stb","Pnt","Stb","Pnt","Stb","Pnt","Stb","Pnt","Stb","Pnt","Stb","Pnt","Stb","Pnt","Stb","Pnt","Stb","Pnt","Stb","Pnt","Stb","Pnt","Stb","Pnt","Stb","Pnt","Stb","Pnt","Stb","Pnt","Stb","Pnt","Stb","Pnt","Stb","Pnt","Stb","Pnt","Stb","Pnt","Stb","Pnt","Stb","Pnt","Stb","Pnt","Stb","Pnt","Stb","Pnt","Stb","Pnt","Stb","Pnt","Stb","Pnt"]
[null,"Kolom1","Kolom2","Kolom3","Kolom4","Kolom5","Kolom6","Kolom7","Kolom8","Kolom9","Kolom10","Kolom11","Kolom12","Kolom13","Kolom14","Kolom15","Kolom16","Kolom17","Kolom18","Kolom19","Kolom20","Kolom21","Kolom22","Kolom23","Kolom24","Kolom25","Kolom26","Kolom27","Kolom28","Kolom29","Kolom30","Kolom31","Kolom32","Kolom33","Kolom34","Kolom35","Kolom36","Kolom37","Kolom38","Kolom39","Kolom40","Kolom41","Kolom42","Kolom43","Kolom44","Kolom45","Kolom46","Kolom47","Kolom48","Kolom49","Kolom50","Kolom51","Kolom52","Kolom53","Kolom54","Kolom55","Kolom56","Kolom57","Kolom5710","Kolom5711","Kolom572","Kolom573","Kolom574","Kolom575","Kolom576","Kolom577","Kolom578","Kolom579","Kolom58","Kolom59","Kolom60","Kolom61","Kolom62","Kolom63","Kolom64","Kolom65"]
[null,"Anthony Laros",{"$f":"COUNTA(E12,G12,I12,K12,M12,O12,Q12,S12,U12,W12,Y12,AA12,AC12,AE12,AG12,AI12,AK12,AM12,AO12,AQ12,AS12,AU12,AW12,AY12,BA12,BC12,BE12,BQ12,BS12,BU12,BW12,BG12,BI12,BK12,BM12,BO12)","v":15},{"$f":"IFERROR(SUM(F12,H12,J12,L12,N12,P12,R12,T12,V12,X12,Z12,AB12,AD12,AF12,AH12,AJ12,AL12,AN12,AP12,AR12,AT12,AV12,AX12,AZ12,BB12,BD12,BF12,BR12,BT12,BV12,BX12,BJ12,BL12,BN12,BP12,BH12)/COUNTA(E12,G12,I12,K12,M12,O12,Q12,S12,U12,W12,Y12,AA12,AC12,AE12,AG12,AI12,AK12,AM12,AO12,AQ12,AS12,AU12,AW12,AY12,BA12,BC12,BE12,BQ12,BS12,BU12,BW12,BG12,BI12,BK12,BM12,BO12),0)","v":22.133333333333333},11,{"$f":"IFERROR(($A$8)-_xlfn.RANK.EQ(E12,$E$12:$E$43),\"\")","v":12},17,{"$f":"IFERROR(($A$8)-_xlfn.RANK.EQ(G12,$G$12:$G$43),\"\")","v":27},12,{"$f":"IFERROR(($A$8)-_xlfn.RANK.EQ(I12,$I$12:$I$43),\"\")","v":12},null,{"$f":"IFERROR(($A$8)-_xlfn.RANK.EQ(K12,$K$12:$K$43),\"\")","v":""},null,{"$f":"IFERROR(($A$8)-_xlfn.RANK.EQ(M12,$M$12:$M$43),\"\")","v":""},null,{"$f":"IFERROR(($A$8)-_xlfn.RANK.EQ(O12,O$12:O$43),\"\")","v":""},null,{"$f":"IFERROR(($A$8)-_xlfn.RANK.EQ(Q12,Q$12:Q$43),\"\")","v":""},null,{"$f":"IFERROR(($A$8)-_xlfn.RANK.EQ(S12,S$12:S$43),\"\")","v":""},null,{"$f":"IFERROR(($A$8)-_xlfn.RANK.EQ(U12,U$12:U$43),\"\")","v":""},18,{"$f":"IFERROR(($A$8)-_xlfn.RANK.EQ(W12,W$12:W$43),\"\")","v":29},19,{"$f":"IFERROR(($A$8)-_xlfn.RANK.EQ(Y12,Y$12:Y$43),\"\")","v":31},13,{"$f":"IFERROR(($A$8)-_xlfn.RANK.EQ(AA12,AA$12:AA$43),\"\")","v":20},19,{"$f":"IFERROR(($A$8)-_xlfn.RANK.EQ(AC12,AC$12:AC$43),\"\")","v":31},16,{"$f":"IFERROR(($A$8)-_xlfn.RANK.EQ(AE12,AE$12:AE$43),\"\")","v":29},null,{"$f":"IFERROR(($A$8)-_xlfn.RANK.EQ(AG12,AG$12:AG$43),\"\")","v":""},null,{"$f":"IFERROR(($A$8)-_xlfn.RANK.EQ(AI12,AI$12:AI$43),\"\")","v":""},null,{"$f":"IFERROR(($A$8)-_xlfn.RANK.EQ(AK12,AK$12:AK$43),\"\")","v":""},null,{"$f":"IFERROR(($A$8)-_xlfn.RANK.EQ(AM12,AM$12:AM$43),\"\")","v":""},null,{"$f":"IFERROR(($A$8)-_xlfn.RANK.EQ(AO12,AO$12:AO$43),\"\")","v":""},null,{"$f":"IFERROR(($A$8)-_xlfn.RANK.EQ(AQ12,AQ$12:AQ$43),\"\")","v":""},null,{"$f":"IFERROR(($A$8)-_xlfn.RANK.EQ(AS12,AS$12:AS$43),\"\")","v":""},null,{"$f":"IFERROR(($A$8)-_xlfn.RANK.EQ(AU12,AU$12:AU$43),\"\")","v":""},null,{"$f":"IFERROR(($A$8)-_xlfn.RANK.EQ(AW12,AW$12:AW$43),\"\")","v":""},null,{"$f":"IFERROR(($A$8)-_xlfn.RANK.EQ(AY12,AY$12:AY$43),\"\")","v":""},16,{"$f":"IFERROR(($A$8)-_xlfn.RANK.EQ(BA12,BA$12:BA$43),\"\")","v":29},14,{"$f":"IFERROR(($A$8)-_xlfn.RANK.EQ(BC12,BC$12:BC$43),\"\")","v":26},null,{"$f":"IFERROR(($A$8)-_xlfn.RANK.EQ(BE12,BE$12:BE$43),\"\")","v":""},11,{"$f":"IFERROR(($A$8)-_xlfn.RANK.EQ(BG12,BG$12:BG$43),\"\")","v":11},11,{"$f":"IFERROR(($A$8)-_xlfn.RANK.EQ(BI12,BI$12:BI$43),\"\")","v":9},15,{"$f":"IFERROR(($A$8)-_xlfn.RANK.EQ(BK12,BK$12:BK$43),\"\")","v":22},null,{"$f":"IFERROR(($A$8)-_xlfn.RANK.EQ(BM12,BM$12:BM$43),\"\")","v":""},null,{"$f":"IFERROR(($A$8)-_xlfn.RANK.EQ(BO12,BO$12:BO$43),\"\")","v":""},null,{"$f":"IFERROR(($A$8)-_xlfn.RANK.EQ(BQ12,BQ$12:BQ$43),\"\")","v":""},11,{"$f":"IFERROR(($A$8)-_xlfn.RANK.EQ(BS12,BS$12:BS$43),\"\")","v":21},17,{"$f":"IFERROR(($A$8)-_xlfn.RANK.EQ(BU12,BU$12:BU$43),\"\")","v":23},null,{"$f":"IFERROR(($A$8)-_xlfn.RANK.EQ(BW12,BW$12:BW$43),\"\")","v":""}]
[null,"Arthur Hopstaken",12,23,21,31,13,13,null,"",15,21,null,"",null,"",null,"",13,17,22,32,null,"",null,"",null,"",null,"",15,25,null,"",null,"",null,"",null,"",null,"",null,"",null,"",null,"",null,"",null,"",null,"",null,{"$f":"IFERROR(($A$8)-_xlfn.RANK.EQ(BC13,BC$12:BC$43),\"\")","v":""},12,12,17,{"$f":"IFERROR(($A$8)-_xlfn.RANK.EQ(BG13,BG$12:BG$43),\"\")","v":32},15,21,14,18,12,22,null,"",20,32,null,"",null,"",null,""]
[null,"Bart de Bot",24,25.125,19,29,null,"",14,17,18,32,18,29,null,"",17,29,16,22,null,"",null,"",null,"",18,30,16,21,15,25,17,31,19,32,18,27,10,21,18,32,13,19,16,31,15,25,null,"",null,"",null,"",null,"",16,24,16,{"$f":"IFERROR(($A$8)-_xlfn.RANK.EQ(BG14,BG$12:BG$43),\"\")","v":27},null,"",12,12,15,26,18,28,null,"",15,24,10,10,null,""]
[null,"Boudewijn v/d Plas",{"$f":"COUNTA(E15,G15,I15,K15,M15,O15,Q15,S15,U15,W15,Y15,AA15,AC15,AE15,AG15,AI15,AK15,AM15,AO15,AQ15,AS15,AU15,AW15,AY15,BA15,BC15,BE15,BQ15,BS15,BU15,BW15,BG15,BI15,BK15,BM15,BO15)","v":21},{"$f":"IFERROR(SUM(F15,H15,J15,L15,N15,P15,R15,T15,V15,X15,Z15,AB15,AD15,AF15,AH15,AJ15,AL15,AN15,AP15,AR15,AT15,AV15,AX15,AZ15,BB15,BD15,BF15,BR15,BT15,BV15,BX15,BJ15,BL15,BN15,BP15,BH15)/COUNTA(E15,G15,I15,K15,M15,O15,Q15,S15,U15,W15,Y15,AA15,AC15,AE15,AG15,AI15,AK15,AM15,AO15,AQ15,AS15,AU15,AW15,AY15,BA15,BC15,BE15,BQ15,BS15,BU15,BW15,BG15,BI15,BK15,BM15,BO15),0)","v":25.476190476190474},20,30,17,27,18,30,17,30,15,23,20,32,12,25,15,19,19,30,22,32,12,22,17,27,17,24,9,21,null,"",null,"",12,21,12,22,null,"",null,"",null,"",null,"",null,"",null,"",17,31,11,15,null,"",null,null,12,12,20,32,null,"",null,"",null,"",null,"",18,30,null,""]
[null,"Daan vd Tuijn",21,26.285714285714285,null,"",16,24,23,32,17,30,14,17,null,"",null,"",21,32,17,26,18,29,18,30,null,"",17,24,20,32,null,"",17,29,null,"",13,24,null,"",21,32,16,31,15,25,null,"",17,27,15,25,13,22,13,16,14,{"$f":"IFERROR(($A$8)-_xlfn.RANK.EQ(BG16,BG$12:BG$43),\"\")","v":19},null,"",17,26,null,"",null,"",null,"",null,"",null,"",null,""]
[null,"Dre Verhoef",19,24.05263157894737,11,12,19,32,null,"",14,17,15,23,13,20,3,21,null,"",17,26,null,"",null,"",null,"",null,"",null,"",null,"",16,27,null,"",null,"",null,"",9,16,13,26,null,"",16,26,18,32,14,22,16,28,16,24,null,"",null,"",null,"",16,30,14,22,12,23,null,"",18,30,null,""]
[null,"Eddy vd Tuijn",22,20.454545454545453,17,23,18,30,17,27,14,17,11,12,10,18,11,24,12,14,17,26,22,32,16,26,14,21,15,17,8,20,18,32,12,21,null,"",null,"",null,"",null,"",null,"",7,18,null,"",17,27,null,"",null,"",12,12,null,"",14,17,8,7,null,"",null,"",null,"",null,"",9,9,null,""]
[null,"Guust v/d Bemd",26,24.23076923076923,null,"",null,"",17,27,15,21,15,23,15,23,null,"",null,"",16,23,null,"",null,"",15,25,16,21,null,"",16,29,19,32,17,25,19,27,12,20,14,22,null,"",17,27,19,30,11,18,12,16,17,30,16,24,13,15,16,24,14,18,12,22,null,"",17,27,19,30,19,31,null,""]
[null,"Jan Bierbooms",25,25.88,null,"",15,21,14,17,null,"",12,15,9,17,14,28,15,19,null,"",null,"",null,"",22,32,16,21,14,23,16,29,null,"",null,"",21,31,null,"",19,29,15,28,21,32,16,26,18,32,19,32,13,22,19,31,null,"",19,32,15,22,17,31,15,26,19,30,null,"",16,21,null,""]
[null,"Jan Hoogstrate",25,26,18,28,15,21,15,22,15,21,18,29,null,"",18,31,21,32,18,28,null,"",16,26,16,26,19,31,null,"",null,"",15,24,13,23,null,"",18,32,17,27,null,"",null,"",null,"",16,22,null,"",null,"",16,24,13,15,14,17,17,26,19,32,15,26,14,25,21,32,18,30,null,""]
[null,"Jef van Noort",11,19.363636363636363,null,"",null,"",15,22,null,"",null,"",null,"",null,"",null,"",13,19,null,"",null,"",null,"",null,"",null,"",7,18,null,"",null,"",null,"",16,29,null,"",null,"",null,"",13,16,null,"",15,25,15,27,14,17,15,22,11,9,11,9,null,"",null,"",null,"",null,"",null,"",null,""]
[null,"Jeroen Mulder",23,24.043478260869566,16,21,null,"",16,24,null,"",15,23,12,19,14,28,20,30,null,"",null,"",null,"",15,25,null,"",16,29,13,23,null,"",19,28,null,"",null,"",14,22,null,"",20,31,17,29,17,27,10,12,13,22,16,24,16,27,13,15,16,24,14,24,null,"",18,29,null,"",14,17,null,""]
[null,"Jos Bergmans",16,24.0625,15,20,15,21,15,22,16,25,17,26,18,29,null,"",null,"",null,"",15,24,21,32,null,"",18,26,null,"",null,"",null,"",null,"",null,"",16,29,null,"",null,"",null,"",null,"",null,"",null,"",null,"",12,12,null,"",16,24,12,12,null,"",null,"",13,24,17,27,20,32,null,""]
[null,"JP Kolthof",21,23.61904761904762,null,"",14,17,17,27,12,14,17,26,16,25,null,"",17,25,null,"",null,"",null,"",null,"",15,17,8,20,null,"",16,27,null,"",20,30,null,"",16,26,null,"",null,"",null,"",10,17,17,31,13,22,19,31,16,27,12,12,18,30,null,"",null,"",20,32,13,23,14,17,null,""]
[null,"Maarten Kaas",{"$f":"COUNTA(E26,G26,I26,K26,M26,O26,Q26,S26,U26,W26,Y26,AA26,AC26,AE26,AG26,AI26,AK26,AM26,AO26,AQ26,AS26,AU26,AW26,AY26,BA26,BC26,BE26,BQ26,BS26,BU26,BW26,BG26,BI26,BK26,BM26,BO26)","v":19},{"$f":"IFERROR(SUM(F26,H26,J26,L26,N26,P26,R26,T26,V26,X26,Z26,AB26,AD26,AF26,AH26,AJ26,AL26,AN26,AP26,AR26,AT26,AV26,AX26,AZ26,BB26,BD26,BF26,BR26,BT26,BV26,BX26,BJ26,BL26,BN26,BP26,BH26)/COUNTA(E26,G26,I26,K26,M26,O26,Q26,S26,U26,W26,Y26,AA26,AC26,AE26,AG26,AI26,AK26,AM26,AO26,AQ26,AS26,AU26,AW26,AY26,BA26,BC26,BE26,BQ26,BS26,BU26,BW26,BG26,BI26,BK26,BM26,BO26),0)","v":24.526315789473685},15,20,14,17,15,22,15,21,15,23,null,"",null,"",null,"",13,19,13,20,null,"",null,"",19,31,null,"",null,"",18,30,12,21,null,"",null,"",null,"",13,26,null,"",17,29,null,"",16,29,12,17,null,"",17,32,null,"",null,"",null,"",15,26,10,21,21,32,18,30,null,""]
[null,"Maurice van Berkel",17,24.058823529411764,null,"",19,32,null,"",18,32,null,"",null,"",null,"",null,"",null,"",19,30,16,26,15,25,21,32,null,"",15,26,null,"",8,19,null,"",15,27,null,"",null,"",null,"",null,"",10,17,null,"",null,"",11,8,13,{"$f":"IFERROR(($A$8)-_xlfn.RANK.EQ(BG27,BG$12:BG$43),\"\")","v":15},16,24,16,24,14,24,null,"",1,18,null,"",18,30,null,""]
[null,"Michiel Vroon",18,26.444444444444443,14,14,null,"",15,22,null,"",null,"",19,31,null,"",19,28,null,"",17,26,9,21,null,"",18,26,18,31,null,"",null,"",20,30,null,"",null,"",null,"",null,"",14,21,16,26,null,"",14,22,17,30,17,27,17,32,19,32,null,"",null,"",17,27,null,"",19,30,null,"",null,""]
[null,"Pascal Mouthaan",24,21.75,14,14,14,17,12,12,17,30,null,"",null,"",null,"",16,22,20,31,null,"",null,"",21,31,16,21,16,29,12,21,16,27,13,23,20,30,15,27,null,"",null,"",null,"",15,21,12,19,11,14,11,15,13,16,null,"",15,21,14,18,15,26,null,"",null,"",13,23,13,14,null,""]
[null,"Patrick Laros",14,22.071428571428573,18,28,null,"",16,24,16,25,12,15,null,"",null,"",null,"",null,"",null,"",null,"",null,"",null,"",16,29,null,"",13,22,null,"",20,30,14,24,null,"",null,"",null,"",null,"",null,"",11,14,12,17,13,16,16,27,18,30,10,8,null,"",null,"",null,"",null,"",null,"",null,""]
[null,"Paul Nijmeijer",22,27.09090909090909,null,"",14,17,null,"",null,"",20,31,16,25,null,"",18,27,null,"",15,24,null,"",null,"",19,31,null,"",null,"",17,29,20,30,19,27,null,"",null,"",16,31,18,28,16,26,null,"",14,22,14,26,19,31,14,19,18,30,18,30,16,30,15,26,null,"",16,26,18,30,null,""]
[null,"Pieter de Bot",14,18,9,9,null,"",14,17,null,"",null,"",null,"",null,"",null,"",null,"",null,"",null,"",null,"",null,"",null,"",10,19,null,"",null,"",13,24,null,"",11,17,null,"",15,25,14,17,null,"",12,16,13,22,8,6,17,32,13,15,12,12,null,"",null,"",null,"",null,"",16,21,null,""]
[null,"PJ de Bot",27,23,22,32,13,13,null,"",13,15,15,23,17,28,null,"",13,17,11,17,14,21,15,23,null,"",17,24,18,31,12,21,null,"",17,25,null,"",null,"",13,19,null,"",19,29,16,26,18,32,15,25,14,26,18,28,14,19,null,"",14,18,11,19,13,21,11,22,16,26,16,21,null,""]
[null,"Richard Smits",20,25.4,15,20,17,27,null,"",17,30,19,30,null,"",11,24,18,27,15,22,null,"",18,30,13,20,null,"",5,18,15,26,null,"",21,32,19,27,15,27,null,"",null,"",17,27,null,"",null,"",14,22,18,31,13,16,null,"",18,30,15,22,null,"",null,"",null,"",null,"",null,"",null,""]
[null,"Ringo Joannes",11,17,15,20,null,"",null,"",null,"",null,"",null,"",null,"",7,12,null,"",null,"",null,"",null,"",11,13,null,"",null,"",null,"",null,"",null,"",13,22,9,16,null,"",11,19,null,"",null,"",null,"",null,"",12,12,10,10,12,12,18,30,null,"",null,"",10,21,null,"",null,"",null,""]
[null,"Ronald Mekes",17,24.470588235294116,17,23,12,11,22,31,16,25,null,"",17,28,null,"",20,30,19,30,null,"",null,"",15,25,15,17,null,"",16,29,null,"",null,"",null,"",18,32,15,23,15,28,null,"",15,21,15,21,null,"",null,"",null,"",null,"",null,"",null,"",null,"",20,31,null,"",null,"",11,11,null,""]
[null,"Sier van den Brand",21,22.047619047619047,15,20,15,21,8,10,17,30,12,15,null,"",11,24,13,17,14,20,null,"",null,"",12,18,null,"",null,"",14,24,null,"",null,"",null,"",null,"",21,32,null,"",15,25,21,32,10,17,null,"",null,"",24,32,14,19,17,25,14,18,16,30,null,"",10,21,null,"",12,13,null,""]
[null,"Tonnie Breeweg",21,25.238095238095237,18,28,18,30,18,30,null,"",23,32,15,23,20,32,16,22,18,28,null,"",null,"",null,"",15,17,null,"",13,23,null,"",18,27,null,"",11,19,20,30,null,"",null,"",17,29,18,32,14,22,14,26,15,18,12,12,null,"",null,"",null,"",null,"",null,"",10,20,18,30,null,""]
[null,"Toon Melisse",14,20.714285714285715,10,10,18,30,18,30,12,14,17,26,5,16,13,26,17,25,null,"",null,"",null,"",null,"",null,"",null,"",null,"",null,"",null,"",null,"",null,"",14,22,null,"",null,"",15,21,null,"",null,"",null,"",11,8,10,10,15,21,19,31,null,"",null,"",null,"",null,"",null,"",null,""]
[null,"Wally Gijzen",21,23.047619047619047,15,20,16,24,14,17,null,"",null,"",17,28,null,"",9,13,15,22,15,24,null,"",12,18,null,"",null,"",null,"",14,23,21,32,null,"",13,22,18,28,null,"",null,"",null,"",17,27,16,29,11,15,16,24,17,32,13,15,14,18,null,"",19,30,null,"",null,"",17,23,null,""]
[null,"Walter Cats",26,28.153846153846153,18,28,null,"",null,"",16,25,18,29,19,31,null,"",17,25,null,"",18,29,18,30,18,30,19,31,null,"",null,"",null,"",null,"",23,32,14,24,16,26,17,32,20,31,15,21,17,27,14,22,21,32,null,"",16,27,18,30,18,30,16,30,21,32,18,29,18,28,16,21,null,""]
[null,"Wappie Broermann",12,23.083333333333332,9,9,null,"",null,"",null,"",null,"",null,"",18,31,null,"",null,"",null,"",null,"",18,30,null,"",13,22,17,31,null,"",null,"",null,"",null,"",null,"",null,"",null,"",12,15,15,21,null,"",null,"",17,27,15,22,18,30,15,22,null,"",null,"",null,"",null,"",14,17,null,""]
[null,"Wilco van den Oever",23,22.869565217391305,18,28,16,24,13,13,12,14,14,17,14,21,null,"",null,"",null,"",16,25,17,27,12,18,11,13,null,"",null,"",null,"",null,"",null,"",null,"",16,26,13,26,12,20,20,31,18,32,16,29,null,"",17,27,15,22,15,21,null,"",12,22,19,30,17,27,null,"",12,13,null,""]

{"sheet":"Gasten","index":3,"n_rows":24,"n_cols":2,"rows_kept":24,"cut":false,"hidden":false,"merged":[]}
[]
["Naam","Aantal"]
["arnold sulkers",13]
["arnold sulkers",16]
["arnold sulkers",12]
["arnold  sulkers",14]
["arnold",16]
["serge roks",13]
["arnold siulkers",14]
["roel elshout",10]
["arnold sulkers",17]
["arnold sulkers",16]
["arnold sulkers",15]
["bart eikhout",17]
["bart eikhout",13]
["arnold sulkers",13]
["bart eikhout",15]
["arnold sulkers",16]
["arnold sulkers",12]
["arnold sulkers",13]
["arnold sulkers",15]
["arnold sulkers",20]
["neef van maurice",14]
["roel elshout",14]

{"sheet":"DATA","index":4,"n_rows":36,"n_cols":14,"rows_kept":36,"cut":false,"hidden":false,"merged":[]}
[null,null,null,null,null,null,null,null,null,null,null,"Weekend"]
["Naam","#","Gem.",null,null,null,"Naam","Stb","Pnt",null,null,"Naam","#","Gem."]
[{"$f":"INDEX(Scoreblad!$B$12:$B$43,MATCH(LARGE((Scoreblad!$D$12:$D$43)+ROW(Scoreblad!$D$12:$D$43)/1000,ROW()-ROW($A$3)+1),(Scoreblad!$D$12:$D$43)+ROW(Scoreblad!$D$12:$D$43)/1000,0))","v":"Walter Cats"},{"$f":"INDEX(Scoreblad!$C$12:$C$43,MATCH(LARGE((Scoreblad!$D$12:$D$43)+ROW(Scoreblad!$D$12:$D$43)/1000,ROW()-ROW($A$3)+1),(Scoreblad!$D$12:$D$43)+ROW(Scoreblad!$D$12:$D$43)/1000,0))","v":26},{"$f":"LARGE(Scoreblad!$D$12:$D$43,ROW()-ROW($A$3)+1)","v":28.153846153846153},null,null,null,{"$f":"Scoreblad!B12","v":"Anthony Laros"},{"$f":"SUMIF(Scoreblad!$E$7:$BX$7,$A$36,Scoreblad!E12:BX12)","v":17},{"$f":"SUMIF(Scoreblad!$E$7:$BX$7,$A$36,Scoreblad!F12:BY12)","v":23},null,null,{"$f":"Scoreblad!B12","v":"Anthony Laros"},{"$f":"COUNTA(Scoreblad!BE12,Scoreblad!BI12,Scoreblad!BK12,Scoreblad!BM12,Scoreblad!BO12,Scoreblad!BG12)","v":3},{"$f":"IFERROR(SUM(Scoreblad!BJ12,Scoreblad!BH12,Scoreblad!BF12,Scoreblad!BL12,Scoreblad!BN12,Scoreblad!BP12)/COUNTA(Scoreblad!BE12,Scoreblad!BG12,Scoreblad!BI12,Scoreblad!BK12,Scoreblad!BM12,Scoreblad!BO12),\"\")","v":14}]
[{"$f":"INDEX(Scoreblad!$B$12:$B$43,MATCH(LARGE((Scoreblad!$D$12:$D$43)+ROW(Scoreblad!$D$12:$D$43)/1000,ROW()-ROW($A$3)+1),(Scoreblad!$D$12:$D$43)+ROW(Scoreblad!$D$12:$D$43)/1000,0))","v":"Paul Nijmeijer"},{"$f":"INDEX(Scoreblad!$C$12:$C$43,MATCH(LARGE((Scoreblad!$D$12:$D$43)+ROW(Scoreblad!$D$12:$D$43)/1000,ROW()-ROW($A$3)+1),(Scoreblad!$D$12:$D$43)+ROW(Scoreblad!$D$12:$D$43)/1000,0))","v":22},{"$f":"LARGE(Scoreblad!$D$12:$D$43,ROW()-ROW($A$3)+1)","v":27.09090909090909},null,null,null,{"$f":"Scoreblad!B13","v":"Arthur Hopstaken"},{"$f":"SUMIF(Scoreblad!$E$7:$BX$7,$A$36,Scoreblad!E13:BX13)","v":0},{"$f":"SUMIF(Scoreblad!$E$7:$BX$7,$A$36,Scoreblad!F13:BY13)","v":0},null,null,{"$f":"Scoreblad!B13","v":"Arthur Hopstaken"},{"$f":"COUNTA(Scoreblad!BE13,Scoreblad!BI13,Scoreblad!BK13,Scoreblad!BM13,Scoreblad!BO13,Scoreblad!BG13)","v":5},{"$f":"IFERROR(SUM(Scoreblad!BJ13,Scoreblad!BH13,Scoreblad!BF13,Scoreblad!BL13,Scoreblad!BN13,Scoreblad!BP13)/COUNTA(Scoreblad!BE13,Scoreblad!BG13,Scoreblad!BI13,Scoreblad!BK13,Scoreblad!BM13,Scoreblad!BO13),\"\")","v":21}]
[{"$f":"INDEX(Scoreblad!$B$12:$B$43,MATCH(LARGE((Scoreblad!$D$12:$D$43)+ROW(Scoreblad!$D$12:$D$43)/1000,ROW()-ROW($A$3)+1),(Scoreblad!$D$12:$D$43)+ROW(Scoreblad!$D$12:$D$43)/1000,0))","v":"Michiel Vroon"},{"$f":"INDEX(Scoreblad!$C$12:$C$43,MATCH(LARGE((Scoreblad!$D$12:$D$43)+ROW(Scoreblad!$D$12:$D$43)/1000,ROW()-ROW($A$3)+1),(Scoreblad!$D$12:$D$43)+ROW(Scoreblad!$D$12:$D$43)/1000,0))","v":18},{"$f":"LARGE(Scoreblad!$D$12:$D$43,ROW()-ROW($A$3)+1)","v":26.444444444444443},null,null,null,{"$f":"Scoreblad!B14","v":"Bart de Bot"},{"$f":"SUMIF(Scoreblad!$E$7:$BX$7,$A$36,Scoreblad!E14:BX14)","v":10},{"$f":"SUMIF(Scoreblad!$E$7:$BX$7,$A$36,Scoreblad!F14:BY14)","v":10},null,null,{"$f":"Scoreblad!B14","v":"Bart de Bot"},{"$f":"COUNTA(Scoreblad!BE14,Scoreblad!BI14,Scoreblad!BK14,Scoreblad!BM14,Scoreblad!BO14,Scoreblad!BG14)","v":5},{"$f":"IFERROR(SUM(Scoreblad!BJ14,Scoreblad!BH14,Scoreblad!BF14,Scoreblad!BL14,Scoreblad!BN14,Scoreblad!BP14)/COUNTA(Scoreblad!BE14,Scoreblad!BG14,Scoreblad!BI14,Scoreblad!BK14,Scoreblad!BM14,Scoreblad!BO14),\"\")","v":23.4}]
[{"$f":"INDEX(Scoreblad!$B$12:$B$43,MATCH(LARGE((Scoreblad!$D$12:$D$43)+ROW(Scoreblad!$D$12:$D$43)/1000,ROW()-ROW($A$3)+1),(Scoreblad!$D$12:$D$43)+ROW(Scoreblad!$D$12:$D$43)/1000,0))","v":"Daan vd Tuijn"},{"$f":"INDEX(Scoreblad!$C$12:$C$43,MATCH(LARGE((Scoreblad!$D$12:$D$43)+ROW(Scoreblad!$D$12:$D$43)/1000,ROW()-ROW($A$3)+1),(Scoreblad!$D$12:$D$43)+ROW(Scoreblad!$D$12:$D$43)/1000,0))","v":21},{"$f":"LARGE(Scoreblad!$D$12:$D$43,ROW()-ROW($A$3)+1)","v":26.285714285714285},null,null,null,{"$f":"Scoreblad!B15","v":"Boudewijn v/d Plas"},{"$f":"SUMIF(Scoreblad!$E$7:$BX$7,$A$36,Scoreblad!E15:BX15)","v":18},{"$f":"SUMIF(Scoreblad!$E$7:$BX$7,$A$36,Scoreblad!F15:BY15)","v":30},null,null,{"$f":"Scoreblad!B16","v":"Daan vd Tuijn"},{"$f":"COUNTA(Scoreblad!BE16,Scoreblad!BI16,Scoreblad!BK16,Scoreblad!BM16,Scoreblad!BO16,Scoreblad!BG16)","v":3},{"$f":"IFERROR(SUM(Scoreblad!BJ16,Scoreblad!BH16,Scoreblad!BF16,Scoreblad!BL16,Scoreblad!BN16,Scoreblad!BP16)/COUNTA(Scoreblad!BE16,Scoreblad!BG16,Scoreblad!BI16,Scoreblad!BK16,Scoreblad!BM16,Scoreblad!BO16),\"\")","v":20.333333333333332}]
[{"$f":"INDEX(Scoreblad!$B$12:$B$43,MATCH(LARGE((Scoreblad!$D$12:$D$43)+ROW(Scoreblad!$D$12:$D$43)/1000,ROW()-ROW($A$3)+1),(Scoreblad!$D$12:$D$43)+ROW(Scoreblad!$D$12:$D$43)/1000,0))","v":"Jan Hoogstrate"},{"$f":"INDEX(Scoreblad!$C$12:$C$43,MATCH(LARGE((Scoreblad!$D$12:$D$43)+ROW(Scoreblad!$D$12:$D$43)/1000,ROW()-ROW($A$3)+1),(Scoreblad!$D$12:$D$43)+ROW(Scoreblad!$D$12:$D$43)/1000,0))","v":25},{"$f":"LARGE(Scoreblad!$D$12:$D$43,ROW()-ROW($A$3)+1)","v":26},null,null,null,{"$f":"Scoreblad!B16","v":"Daan vd Tuijn"},{"$f":"SUMIF(Scoreblad!$E$7:$BX$7,$A$36,Scoreblad!E16:BX16)","v":0},{"$f":"SUMIF(Scoreblad!$E$7:$BX$7,$A$36,Scoreblad!F16:BY16)","v":0},null,null,{"$f":"Scoreblad!B17","v":"Dre Verhoef"},{"$f":"COUNTA(Scoreblad!BE17,Scoreblad!BI17,Scoreblad!BK17,Scoreblad!BM17,Scoreblad!BO17,Scoreblad!BG17)","v":3},{"$f":"IFERROR(SUM(Scoreblad!BJ17,Scoreblad!BH17,Scoreblad!BF17,Scoreblad!BL17,Scoreblad!BN17,Scoreblad!BP17)/COUNTA(Scoreblad!BE17,Scoreblad!BG17,Scoreblad!BI17,Scoreblad!BK17,Scoreblad!BM17,Scoreblad!BO17),\"\")","v":25.333333333333332}]
[{"$f":"INDEX(Scoreblad!$B$12:$B$43,MATCH(LARGE((Scoreblad!$D$12:$D$43)+ROW(Scoreblad!$D$12:$D$43)/1000,ROW()-ROW($A$3)+1),(Scoreblad!$D$12:$D$43)+ROW(Scoreblad!$D$12:$D$43)/1000,0))","v":"Jan Bierbooms"},{"$f":"INDEX(Scoreblad!$C$12:$C$43,MATCH(LARGE((Scoreblad!$D$12:$D$43)+ROW(Scoreblad!$D$12:$D$43)/1000,ROW()-ROW($A$3)+1),(Scoreblad!$D$12:$D$43)+ROW(Scoreblad!$D$12:$D$43)/1000,0))","v":25},{"$f":"LARGE(Scoreblad!$D$12:$D$43,ROW()-ROW($A$3)+1)","v":25.88},null,null,null,{"$f":"Scoreblad!B17","v":"Dre Verhoef"},{"$f":"SUMIF(Scoreblad!$E$7:$BX$7,$A$36,Scoreblad!E17:BX17)","v":18},{"$f":"SUMIF(Scoreblad!$E$7:$BX$7,$A$36,Scoreblad!F17:BY17)","v":30},null,null,{"$f":"Scoreblad!B18","v":"Eddy vd Tuijn"},{"$f":"COUNTA(Scoreblad!BE18,Scoreblad!BI18,Scoreblad!BK18,Scoreblad!BM18,Scoreblad!BO18,Scoreblad!BG18)","v":3},{"$f":"IFERROR(SUM(Scoreblad!BJ18,Scoreblad!BH18,Scoreblad!BF18,Scoreblad!BL18,Scoreblad!BN18,Scoreblad!BP18)/COUNTA(Scoreblad!BE18,Scoreblad!BG18,Scoreblad!BI18,Scoreblad!BK18,Scoreblad!BM18,Scoreblad!BO18),\"\")","v":12}]
[{"$f":"INDEX(Scoreblad!$B$12:$B$43,MATCH(LARGE((Scoreblad!$D$12:$D$43)+ROW(Scoreblad!$D$12:$D$43)/1000,ROW()-ROW($A$3)+1),(Scoreblad!$D$12:$D$43)+ROW(Scoreblad!$D$12:$D$43)/1000,0))","v":"Boudewijn v/d Plas"},{"$f":"INDEX(Scoreblad!$C$12:$C$43,MATCH(LARGE((Scoreblad!$D$12:$D$43)+ROW(Scoreblad!$D$12:$D$43)/1000,ROW()-ROW($A$3)+1),(Scoreblad!$D$12:$D$43)+ROW(Scoreblad!$D$12:$D$43)/1000,0))","v":21},{"$f":"LARGE(Scoreblad!$D$12:$D$43,ROW()-ROW($A$3)+1)","v":25.476190476190474},null,null,null,{"$f":"Scoreblad!B18","v":"Eddy vd Tuijn"},{"$f":"SUMIF(Scoreblad!$E$7:$BX$7,$A$36,Scoreblad!E18:BX18)","v":9},{"$f":"SUMIF(Scoreblad!$E$7:$BX$7,$A$36,Scoreblad!F18:BY18)","v":9},null,null,{"$f":"Scoreblad!B19","v":"Guust v/d Bemd"},{"$f":"COUNTA(Scoreblad!BE19,Scoreblad!BI19,Scoreblad!BK19,Scoreblad!BM19,Scoreblad!BO19,Scoreblad!BG19)","v":5},{"$f":"IFERROR(SUM(Scoreblad!BJ19,Scoreblad!BH19,Scoreblad!BF19,Scoreblad!BL19,Scoreblad!BN19,Scoreblad!BP19)/COUNTA(Scoreblad!BE19,Scoreblad!BG19,Scoreblad!BI19,Scoreblad!BK19,Scoreblad!BM19,Scoreblad!BO19),\"\")","v":20.6}]
[{"$f":"INDEX(Scoreblad!$B$12:$B$43,MATCH(LARGE((Scoreblad!$D$12:$D$43)+ROW(Scoreblad!$D$12:$D$43)/1000,ROW()-ROW($A$3)+1),(Scoreblad!$D$12:$D$43)+ROW(Scoreblad!$D$12:$D$43)/1000,0))","v":"Richard Smits"},{"$f":"INDEX(Scoreblad!$C$12:$C$43,MATCH(LARGE((Scoreblad!$D$12:$D$43)+ROW(Scoreblad!$D$12:$D$43)/1000,ROW()-ROW($A$3)+1),(Scoreblad!$D$12:$D$43)+ROW(Scoreblad!$D$12:$D$43)/1000,0))","v":20},{"$f":"LARGE(Scoreblad!$D$12:$D$43,ROW()-ROW($A$3)+1)","v":25.4},null,null,null,{"$f":"Scoreblad!B19","v":"Guust v/d Bemd"},{"$f":"SUMIF(Scoreblad!$E$7:$BX$7,$A$36,Scoreblad!E19:BX19)","v":19},{"$f":"SUMIF(Scoreblad!$E$7:$BX$7,$A$36,Scoreblad!F19:BY19)","v":31},null,null,{"$f":"Scoreblad!B20","v":"Jan Bierbooms"},{"$f":"COUNTA(Scoreblad!BE20,Scoreblad!BI20,Scoreblad!BK20,Scoreblad!BM20,Scoreblad!BO20,Scoreblad!BG20)","v":5},{"$f":"IFERROR(SUM(Scoreblad!BJ20,Scoreblad!BH20,Scoreblad!BF20,Scoreblad!BL20,Scoreblad!BN20,Scoreblad!BP20)/COUNTA(Scoreblad!BE20,Scoreblad!BG20,Scoreblad!BI20,Scoreblad!BK20,Scoreblad!BM20,Scoreblad!BO20),\"\")","v":28.4}]
[{"$f":"INDEX(Scoreblad!$B$12:$B$43,MATCH(LARGE((Scoreblad!$D$12:$D$43)+ROW(Scoreblad!$D$12:$D$43)/1000,ROW()-ROW($A$3)+1),(Scoreblad!$D$12:$D$43)+ROW(Scoreblad!$D$12:$D$43)/1000,0))","v":"Tonnie Breeweg"},{"$f":"INDEX(Scoreblad!$C$12:$C$43,MATCH(LARGE((Scoreblad!$D$12:$D$43)+ROW(Scoreblad!$D$12:$D$43)/1000,ROW()-ROW($A$3)+1),(Scoreblad!$D$12:$D$43)+ROW(Scoreblad!$D$12:$D$43)/1000,0))","v":21},{"$f":"LARGE(Scoreblad!$D$12:$D$43,ROW()-ROW($A$3)+1)","v":25.238095238095237},null,null,null,{"$f":"Scoreblad!B20","v":"Jan Bierbooms"},{"$f":"SUMIF(Scoreblad!$E$7:$BX$7,$A$36,Scoreblad!E20:BX20)","v":16},{"$f":"SUMIF(Scoreblad!$E$7:$BX$7,$A$36,Scoreblad!F20:BY20)","v":21},null,null,{"$f":"Scoreblad!B21","v":"Jan Hoogstrate"},{"$f":"COUNTA(Scoreblad!BE21,Scoreblad!BI21,Scoreblad!BK21,Scoreblad!BM21,Scoreblad!BO21,Scoreblad!BG21)","v":6},{"$f":"IFERROR(SUM(Scoreblad!BJ21,Scoreblad!BH21,Scoreblad!BF21,Scoreblad!BL21,Scoreblad!BN21,Scoreblad!BP21)/COUNTA(Scoreblad!BE21,Scoreblad!BG21,Scoreblad!BI21,Scoreblad!BK21,Scoreblad!BM21,Scoreblad!BO21),\"\")","v":23.333333333333332}]
[{"$f":"INDEX(Scoreblad!$B$12:$B$43,MATCH(LARGE((Scoreblad!$D$12:$D$43)+ROW(Scoreblad!$D$12:$D$43)/1000,ROW()-ROW($A$3)+1),(Scoreblad!$D$12:$D$43)+ROW(Scoreblad!$D$12:$D$43)/1000,0))","v":"Bart de Bot"},{"$f":"INDEX(Scoreblad!$C$12:$C$43,MATCH(LARGE((Scoreblad!$D$12:$D$43)+ROW(Scoreblad!$D$12:$D$43)/1000,ROW()-ROW($A$3)+1),(Scoreblad!$D$12:$D$43)+ROW(Scoreblad!$D$12:$D$43)/1000,0))","v":24},{"$f":"LARGE(Scoreblad!$D$12:$D$43,ROW()-ROW($A$3)+1)","v":25.125},null,null,null,{"$f":"Scoreblad!B21","v":"Jan Hoogstrate"},{"$f":"SUMIF(Scoreblad!$E$7:$BX$7,$A$36,Scoreblad!E21:BX21)","v":18},{"$f":"SUMIF(Scoreblad!$E$7:$BX$7,$A$36,Scoreblad!F21:BY21)","v":30},null,null,{"$f":"Scoreblad!B22","v":"Jef van Noort"},{"$f":"COUNTA(Scoreblad!BE22,Scoreblad!BI22,Scoreblad!BK22,Scoreblad!BM22,Scoreblad!BO22,Scoreblad!BG22)","v":4},{"$f":"IFERROR(SUM(Scoreblad!BJ22,Scoreblad!BH22,Scoreblad!BF22,Scoreblad!BL22,Scoreblad!BN22,Scoreblad!BP22)/COUNTA(Scoreblad!BE22,Scoreblad!BG22,Scoreblad!BI22,Scoreblad!BK22,Scoreblad!BM22,Scoreblad!BO22),\"\")","v":14.25}]
[{"$f":"INDEX(Scoreblad!$B$12:$B$43,MATCH(LARGE((Scoreblad!$D$12:$D$43)+ROW(Scoreblad!$D$12:$D$43)/1000,ROW()-ROW($A$3)+1),(Scoreblad!$D$12:$D$43)+ROW(Scoreblad!$D$12:$D$43)/1000,0))","v":"Maarten Kaas"},{"$f":"INDEX(Scoreblad!$C$12:$C$43,MATCH(LARGE((Scoreblad!$D$12:$D$43)+ROW(Scoreblad!$D$12:$D$43)/1000,ROW()-ROW($A$3)+1),(Scoreblad!$D$12:$D$43)+ROW(Scoreblad!$D$12:$D$43)/1000,0))","v":19},{"$f":"LARGE(Scoreblad!$D$12:$D$43,ROW()-ROW($A$3)+1)","v":24.526315789473685},null,null,null,{"$f":"Scoreblad!B22","v":"Jef van Noort"},{"$f":"SUMIF(Scoreblad!$E$7:$BX$7,$A$36,Scoreblad!E22:BX22)","v":0},{"$f":"SUMIF(Scoreblad!$E$7:$BX$7,$A$36,Scoreblad!F22:BY22)","v":0},null,null,{"$f":"Scoreblad!B23","v":"Jeroen Mulder"},{"$f":"COUNTA(Scoreblad!BE23,Scoreblad!BI23,Scoreblad!BK23,Scoreblad!BM23,Scoreblad!BO23,Scoreblad!BG23)","v":5},{"$f":"IFERROR(SUM(Scoreblad!BJ23,Scoreblad!BH23,Scoreblad!BF23,Scoreblad!BL23,Scoreblad!BN23,Scoreblad!BP23)/COUNTA(Scoreblad!BE23,Scoreblad!BG23,Scoreblad!BI23,Scoreblad!BK23,Scoreblad!BM23,Scoreblad!BO23),\"\")","v":22.8}]
[{"$f":"INDEX(Scoreblad!$B$12:$B$43,MATCH(LARGE((Scoreblad!$D$12:$D$43)+ROW(Scoreblad!$D$12:$D$43)/1000,ROW()-ROW($A$3)+1),(Scoreblad!$D$12:$D$43)+ROW(Scoreblad!$D$12:$D$43)/1000,0))","v":"Ronald Mekes"},{"$f":"INDEX(Scoreblad!$C$12:$C$43,MATCH(LARGE((Scoreblad!$D$12:$D$43)+ROW(Scoreblad!$D$12:$D$43)/1000,ROW()-ROW($A$3)+1),(Scoreblad!$D$12:$D$43)+ROW(Scoreblad!$D$12:$D$43)/1000,0))","v":17},{"$f":"LARGE(Scoreblad!$D$12:$D$43,ROW()-ROW($A$3)+1)","v":24.470588235294116},null,null,null,{"$f":"Scoreblad!B23","v":"Jeroen Mulder"},{"$f":"SUMIF(Scoreblad!$E$7:$BX$7,$A$36,Scoreblad!E23:BX23)","v":14},{"$f":"SUMIF(Scoreblad!$E$7:$BX$7,$A$36,Scoreblad!F23:BY23)","v":17},null,null,{"$f":"Scoreblad!B24","v":"Jos Bergmans"},{"$f":"COUNTA(Scoreblad!BE24,Scoreblad!BI24,Scoreblad!BK24,Scoreblad!BM24,Scoreblad!BO24,Scoreblad!BG24)","v":3},{"$f":"IFERROR(SUM(Scoreblad!BJ24,Scoreblad!BH24,Scoreblad!BF24,Scoreblad!BL24,Scoreblad!BN24,Scoreblad!BP24)/COUNTA(Scoreblad!BE24,Scoreblad!BG24,Scoreblad!BI24,Scoreblad!BK24,Scoreblad!BM24,Scoreblad!BO24),\"\")","v":16}]
[{"$f":"INDEX(Scoreblad!$B$12:$B$43,MATCH(LARGE((Scoreblad!$D$12:$D$43)+ROW(Scoreblad!$D$12:$D$43)/1000,ROW()-ROW($A$3)+1),(Scoreblad!$D$12:$D$43)+ROW(Scoreblad!$D$12:$D$43)/1000,0))","v":"Guust v/d Bemd"},{"$f":"INDEX(Scoreblad!$C$12:$C$43,MATCH(LARGE((Scoreblad!$D$12:$D$43)+ROW(Scoreblad!$D$12:$D$43)/1000,ROW()-ROW($A$3)+1),(Scoreblad!$D$12:$D$43)+ROW(Scoreblad!$D$12:$D$43)/1000,0))","v":26},{"$f":"LARGE(Scoreblad!$D$12:$D$43,ROW()-ROW($A$3)+1)","v":24.23076923076923},null,null,null,{"$f":"Scoreblad!B24","v":"Jos Bergmans"},{"$f":"SUMIF(Scoreblad!$E$7:$BX$7,$A$36,Scoreblad!E24:BX24)","v":20},{"$f":"SUMIF(Scoreblad!$E$7:$BX$7,$A$36,Scoreblad!F24:BY24)","v":32},null,null,{"$f":"Scoreblad!B25","v":"JP Kolthof"},{"$f":"COUNTA(Scoreblad!BE25,Scoreblad!BI25,Scoreblad!BK25,Scoreblad!BM25,Scoreblad!BO25,Scoreblad!BG25)","v":4},{"$f":"IFERROR(SUM(Scoreblad!BJ25,Scoreblad!BH25,Scoreblad!BF25,Scoreblad!BL25,Scoreblad!BN25,Scoreblad!BP25)/COUNTA(Scoreblad!BE25,Scoreblad!BG25,Scoreblad!BI25,Scoreblad!BK25,Scoreblad!BM25,Scoreblad!BO25),\"\")","v":25}]
[{"$f":"INDEX(Scoreblad!$B$12:$B$43,MATCH(LARGE((Scoreblad!$D$12:$D$43)+ROW(Scoreblad!$D$12:$D$43)/1000,ROW()-ROW($A$3)+1),(Scoreblad!$D$12:$D$43)+ROW(Scoreblad!$D$12:$D$43)/1000,0))","v":"Jos Bergmans"},{"$f":"INDEX(Scoreblad!$C$12:$C$43,MATCH(LARGE((Scoreblad!$D$12:$D$43)+ROW(Scoreblad!$D$12:$D$43)/1000,ROW()-ROW($A$3)+1),(Scoreblad!$D$12:$D$43)+ROW(Scoreblad!$D$12:$D$43)/1000,0))","v":16},{"$f":"LARGE(Scoreblad!$D$12:$D$43,ROW()-ROW($A$3)+1)","v":24.0625},null,null,null,{"$f":"Scoreblad!B25","v":"JP Kolthof"},{"$f":"SUMIF(Scoreblad!$E$7:$BX$7,$A$36,Scoreblad!E25:BX25)","v":14},{"$f":"SUMIF(Scoreblad!$E$7:$BX$7,$A$36,Scoreblad!F25:BY25)","v":17},null,null,{"$f":"Scoreblad!B27","v":"Maurice van Berkel"},{"$f":"COUNTA(Scoreblad!BE27,Scoreblad!BI27,Scoreblad!BK27,Scoreblad!BM27,Scoreblad!BO27,Scoreblad!BG27)","v":5},{"$f":"IFERROR(SUM(Scoreblad!BJ27,Scoreblad!BH27,Scoreblad!BF27,Scoreblad!BL27,Scoreblad!BN27,Scoreblad!BP27)/COUNTA(Scoreblad!BE27,Scoreblad!BG27,Scoreblad!BI27,Scoreblad!BK27,Scoreblad!BM27,Scoreblad!BO27),\"\")","v":19}]
[{"$f":"INDEX(Scoreblad!$B$12:$B$43,MATCH(LARGE((Scoreblad!$D$12:$D$43)+ROW(Scoreblad!$D$12:$D$43)/1000,ROW()-ROW($A$3)+1),(Scoreblad!$D$12:$D$43)+ROW(Scoreblad!$D$12:$D$43)/1000,0))","v":"Maurice van Berkel"},{"$f":"INDEX(Scoreblad!$C$12:$C$43,MATCH(LARGE((Scoreblad!$D$12:$D$43)+ROW(Scoreblad!$D$12:$D$43)/1000,ROW()-ROW($A$3)+1),(Scoreblad!$D$12:$D$43)+ROW(Scoreblad!$D$12:$D$43)/1000,0))","v":17},{"$f":"LARGE(Scoreblad!$D$12:$D$43,ROW()-ROW($A$3)+1)","v":24.058823529411764},null,null,null,{"$f":"Scoreblad!B26","v":"Maarten Kaas"},{"$f":"SUMIF(Scoreblad!$E$7:$BX$7,$A$36,Scoreblad!E26:BX26)","v":18},{"$f":"SUMIF(Scoreblad!$E$7:$BX$7,$A$36,Scoreblad!F26:BY26)","v":30},null,null,{"$f":"Scoreblad!B28","v":"Michiel Vroon"},{"$f":"COUNTA(Scoreblad!BE28,Scoreblad!BI28,Scoreblad!BK28,Scoreblad!BM28,Scoreblad!BO28,Scoreblad!BG28)","v":4},{"$f":"IFERROR(SUM(Scoreblad!BJ28,Scoreblad!BH28,Scoreblad!BF28,Scoreblad!BL28,Scoreblad!BN28,Scoreblad!BP28)/COUNTA(Scoreblad!BE28,Scoreblad!BG28,Scoreblad!BI28,Scoreblad!BK28,Scoreblad!BM28,Scoreblad!BO28),\"\")","v":29.5}]
[{"$f":"INDEX(Scoreblad!$B$12:$B$43,MATCH(LARGE((Scoreblad!$D$12:$D$43)+ROW(Scoreblad!$D$12:$D$43)/1000,ROW()-ROW($A$3)+1),(Scoreblad!$D$12:$D$43)+ROW(Scoreblad!$D$12:$D$43)/1000,0))","v":"Dre Verhoef"},{"$f":"INDEX(Scoreblad!$C$12:$C$43,MATCH(LARGE((Scoreblad!$D$12:$D$43)+ROW(Scoreblad!$D$12:$D$43)/1000,ROW()-ROW($A$3)+1),(Scoreblad!$D$12:$D$43)+ROW(Scoreblad!$D$12:$D$43)/1000,0))","v":19},{"$f":"LARGE(Scoreblad!$D$12:$D$43,ROW()-ROW($A$3)+1)","v":24.05263157894737},null,null,null,{"$f":"Scoreblad!B27","v":"Maurice van Berkel"},{"$f":"SUMIF(Scoreblad!$E$7:$BX$7,$A$36,Scoreblad!E27:BX27)","v":18},{"$f":"SUMIF(Scoreblad!$E$7:$BX$7,$A$36,Scoreblad!F27:BY27)","v":30},null,null,{"$f":"Scoreblad!B29","v":"Pascal Mouthaan"},{"$f":"COUNTA(Scoreblad!BE29,Scoreblad!BI29,Scoreblad!BK29,Scoreblad!BM29,Scoreblad!BO29,Scoreblad!BG29)","v":4},{"$f":"IFERROR(SUM(Scoreblad!BJ29,Scoreblad!BH29,Scoreblad!BF29,Scoreblad!BL29,Scoreblad!BN29,Scoreblad!BP29)/COUNTA(Scoreblad!BE29,Scoreblad!BG29,Scoreblad!BI29,Scoreblad!BK29,Scoreblad!BM29,Scoreblad!BO29),\"\")","v":20.25}]
[{"$f":"INDEX(Scoreblad!$B$12:$B$43,MATCH(LARGE((Scoreblad!$D$12:$D$43)+ROW(Scoreblad!$D$12:$D$43)/1000,ROW()-ROW($A$3)+1),(Scoreblad!$D$12:$D$43)+ROW(Scoreblad!$D$12:$D$43)/1000,0))","v":"Jeroen Mulder"},{"$f":"INDEX(Scoreblad!$C$12:$C$43,MATCH(LARGE((Scoreblad!$D$12:$D$43)+ROW(Scoreblad!$D$12:$D$43)/1000,ROW()-ROW($A$3)+1),(Scoreblad!$D$12:$D$43)+ROW(Scoreblad!$D$12:$D$43)/1000,0))","v":23},{"$f":"LARGE(Scoreblad!$D$12:$D$43,ROW()-ROW($A$3)+1)","v":24.043478260869566},null,null,null,{"$f":"Scoreblad!B28","v":"Michiel Vroon"},{"$f":"SUMIF(Scoreblad!$E$7:$BX$7,$A$36,Scoreblad!E28:BX28)","v":0},{"$f":"SUMIF(Scoreblad!$E$7:$BX$7,$A$36,Scoreblad!F28:BY28)","v":0},null,null,{"$f":"Scoreblad!B30","v":"Patrick Laros"},{"$f":"COUNTA(Scoreblad!BE30,Scoreblad!BI30,Scoreblad!BK30,Scoreblad!BM30,Scoreblad!BO30,Scoreblad!BG30)","v":4},{"$f":"IFERROR(SUM(Scoreblad!BJ30,Scoreblad!BH30,Scoreblad!BF30,Scoreblad!BL30,Scoreblad!BN30,Scoreblad!BP30)/COUNTA(Scoreblad!BE30,Scoreblad!BG30,Scoreblad!BI30,Scoreblad!BK30,Scoreblad!BM30,Scoreblad!BO30),\"\")","v":20.25}]
[{"$f":"INDEX(Scoreblad!$B$12:$B$43,MATCH(LARGE((Scoreblad!$D$12:$D$43)+ROW(Scoreblad!$D$12:$D$43)/1000,ROW()-ROW($A$3)+1),(Scoreblad!$D$12:$D$43)+ROW(Scoreblad!$D$12:$D$43)/1000,0))","v":"JP Kolthof"},{"$f":"INDEX(Scoreblad!$C$12:$C$43,MATCH(LARGE((Scoreblad!$D$12:$D$43)+ROW(Scoreblad!$D$12:$D$43)/1000,ROW()-ROW($A$3)+1),(Scoreblad!$D$12:$D$43)+ROW(Scoreblad!$D$12:$D$43)/1000,0))","v":21},{"$f":"LARGE(Scoreblad!$D$12:$D$43,ROW()-ROW($A$3)+1)","v":23.61904761904762},null,null,null,{"$f":"Scoreblad!B29","v":"Pascal Mouthaan"},{"$f":"SUMIF(Scoreblad!$E$7:$BX$7,$A$36,Scoreblad!E29:BX29)","v":13},{"$f":"SUMIF(Scoreblad!$E$7:$BX$7,$A$36,Scoreblad!F29:BY29)","v":14},null,null,{"$f":"Scoreblad!B31","v":"Paul Nijmeijer"},{"$f":"COUNTA(Scoreblad!BE31,Scoreblad!BI31,Scoreblad!BK31,Scoreblad!BM31,Scoreblad!BO31,Scoreblad!BG31)","v":6},{"$f":"IFERROR(SUM(Scoreblad!BJ31,Scoreblad!BH31,Scoreblad!BF31,Scoreblad!BL31,Scoreblad!BN31,Scoreblad!BP31)/COUNTA(Scoreblad!BE31,Scoreblad!BG31,Scoreblad!BI31,Scoreblad!BK31,Scoreblad!BM31,Scoreblad!BO31),\"\")","v":27.666666666666668}]
[{"$f":"INDEX(Scoreblad!$B$12:$B$43,MATCH(LARGE((Scoreblad!$D$12:$D$43)+ROW(Scoreblad!$D$12:$D$43)/1000,ROW()-ROW($A$3)+1),(Scoreblad!$D$12:$D$43)+ROW(Scoreblad!$D$12:$D$43)/1000,0))","v":"Wappie Broermann"},{"$f":"INDEX(Scoreblad!$C$12:$C$43,MATCH(LARGE((Scoreblad!$D$12:$D$43)+ROW(Scoreblad!$D$12:$D$43)/1000,ROW()-ROW($A$3)+1),(Scoreblad!$D$12:$D$43)+ROW(Scoreblad!$D$12:$D$43)/1000,0))","v":12},{"$f":"LARGE(Scoreblad!$D$12:$D$43,ROW()-ROW($A$3)+1)","v":23.083333333333332},null,null,null,{"$f":"Scoreblad!B30","v":"Patrick Laros"},{"$f":"SUMIF(Scoreblad!$E$7:$BX$7,$A$36,Scoreblad!E30:BX30)","v":0},{"$f":"SUMIF(Scoreblad!$E$7:$BX$7,$A$36,Scoreblad!F30:BY30)","v":0},null,null,{"$f":"Scoreblad!B32","v":"Pieter de Bot"},{"$f":"COUNTA(Scoreblad!BE32,Scoreblad!BI32,Scoreblad!BK32,Scoreblad!BM32,Scoreblad!BO32,Scoreblad!BG32)","v":4},{"$f":"IFERROR(SUM(Scoreblad!BJ32,Scoreblad!BH32,Scoreblad!BF32,Scoreblad!BL32,Scoreblad!BN32,Scoreblad!BP32)/COUNTA(Scoreblad!BE32,Scoreblad!BG32,Scoreblad!BI32,Scoreblad!BK32,Scoreblad!BM32,Scoreblad!BO32),\"\")","v":16.25}]
[{"$f":"INDEX(Scoreblad!$B$12:$B$43,MATCH(LARGE((Scoreblad!$D$12:$D$43)+ROW(Scoreblad!$D$12:$D$43)/1000,ROW()-ROW($A$3)+1),(Scoreblad!$D$12:$D$43)+ROW(Scoreblad!$D$12:$D$43)/1000,0))","v":"Wally Gijzen"},{"$f":"INDEX(Scoreblad!$C$12:$C$43,MATCH(LARGE((Scoreblad!$D$12:$D$43)+ROW(Scoreblad!$D$12:$D$43)/1000,ROW()-ROW($A$3)+1),(Scoreblad!$D$12:$D$43)+ROW(Scoreblad!$D$12:$D$43)/1000,0))","v":21},{"$f":"LARGE(Scoreblad!$D$12:$D$43,ROW()-ROW($A$3)+1)","v":23.047619047619047},null,null,null,{"$f":"Scoreblad!B31","v":"Paul Nijmeijer"},{"$f":"SUMIF(Scoreblad!$E$7:$BX$7,$A$36,Scoreblad!E31:BX31)","v":18},{"$f":"SUMIF(Scoreblad!$E$7:$BX$7,$A$36,Scoreblad!F31:BY31)","v":30},null,null,{"$f":"Scoreblad!B33","v":"PJ de Bot"},{"$f":"COUNTA(Scoreblad!BE33,Scoreblad!BI33,Scoreblad!BK33,Scoreblad!BM33,Scoreblad!BO33,Scoreblad!BG33)","v":5},{"$f":"IFERROR(SUM(Scoreblad!BJ33,Scoreblad!BH33,Scoreblad!BF33,Scoreblad!BL33,Scoreblad!BN33,Scoreblad!BP33)/COUNTA(Scoreblad!BE33,Scoreblad!BG33,Scoreblad!BI33,Scoreblad!BK33,Scoreblad!BM33,Scoreblad!BO33),\"\")","v":21}]
[{"$f":"INDEX(Scoreblad!$B$12:$B$43,MATCH(LARGE((Scoreblad!$D$12:$D$43)+ROW(Scoreblad!$D$12:$D$43)/1000,ROW()-ROW($A$3)+1),(Scoreblad!$D$12:$D$43)+ROW(Scoreblad!$D$12:$D$43)/1000,0))","v":"PJ de Bot"},{"$f":"INDEX(Scoreblad!$C$12:$C$43,MATCH(LARGE((Scoreblad!$D$12:$D$43)+ROW(Scoreblad!$D$12:$D$43)/1000,ROW()-ROW($A$3)+1),(Scoreblad!$D$12:$D$43)+ROW(Scoreblad!$D$12:$D$43)/1000,0))","v":27},{"$f":"LARGE(Scoreblad!$D$12:$D$43,ROW()-ROW($A$3)+1)","v":23},null,null,null,{"$f":"Scoreblad!B32","v":"Pieter de Bot"},{"$f":"SUMIF(Scoreblad!$E$7:$BX$7,$A$36,Scoreblad!E32:BX32)","v":16},{"$f":"SUMIF(Scoreblad!$E$7:$BX$7,$A$36,Scoreblad!F32:BY32)","v":21},null,null,{"$f":"Scoreblad!B34","v":"Richard Smits"},{"$f":"COUNTA(Scoreblad!BE34,Scoreblad!BI34,Scoreblad!BK34,Scoreblad!BM34,Scoreblad!BO34,Scoreblad!BG34)","v":3},{"$f":"IFERROR(SUM(Scoreblad!BJ34,Scoreblad!BH34,Scoreblad!BF34,Scoreblad!BL34,Scoreblad!BN34,Scoreblad!BP34)/COUNTA(Scoreblad!BE34,Scoreblad!BG34,Scoreblad!BI34,Scoreblad!BK34,Scoreblad!BM34,Scoreblad!BO34),\"\")","v":22.666666666666668}]
[{"$f":"INDEX(Scoreblad!$B$12:$B$43,MATCH(LARGE((Scoreblad!$D$12:$D$43)+ROW(Scoreblad!$D$12:$D$43)/1000,ROW()-ROW($A$3)+1),(Scoreblad!$D$12:$D$43)+ROW(Scoreblad!$D$12:$D$43)/1000,0))","v":"Arthur Hopstaken"},{"$f":"INDEX(Scoreblad!$C$12:$C$43,MATCH(LARGE((Scoreblad!$D$12:$D$43)+ROW(Scoreblad!$D$12:$D$43)/1000,ROW()-ROW($A$3)+1),(Scoreblad!$D$12:$D$43)+ROW(Scoreblad!$D$12:$D$43)/1000,0))","v":12},{"$f":"LARGE(Scoreblad!$D$12:$D$43,ROW()-ROW($A$3)+1)","v":23},null,null,null,{"$f":"Scoreblad!B33","v":"PJ de Bot"},{"$f":"SUMIF(Scoreblad!$E$7:$BX$7,$A$36,Scoreblad!E33:BX33)","v":16},{"$f":"SUMIF(Scoreblad!$E$7:$BX$7,$A$36,Scoreblad!F33:BY33)","v":21},null,null,{"$f":"Scoreblad!B35","v":"Ringo Joannes"},{"$f":"COUNTA(Scoreblad!BE35,Scoreblad!BI35,Scoreblad!BK35,Scoreblad!BM35,Scoreblad!BO35,Scoreblad!BG35)","v":4},{"$f":"IFERROR(SUM(Scoreblad!BJ35,Scoreblad!BH35,Scoreblad!BF35,Scoreblad!BL35,Scoreblad!BN35,Scoreblad!BP35)/COUNTA(Scoreblad!BE35,Scoreblad!BG35,Scoreblad!BI35,Scoreblad!BK35,Scoreblad!BM35,Scoreblad!BO35),\"\")","v":16}]
[{"$f":"INDEX(Scoreblad!$B$12:$B$43,MATCH(LARGE((Scoreblad!$D$12:$D$43)+ROW(Scoreblad!$D$12:$D$43)/1000,ROW()-ROW($A$3)+1),(Scoreblad!$D$12:$D$43)+ROW(Scoreblad!$D$12:$D$43)/1000,0))","v":"Wilco van den Oever"},{"$f":"INDEX(Scoreblad!$C$12:$C$43,MATCH(LARGE((Scoreblad!$D$12:$D$43)+ROW(Scoreblad!$D$12:$D$43)/1000,ROW()-ROW($A$3)+1),(Scoreblad!$D$12:$D$43)+ROW(Scoreblad!$D$12:$D$43)/1000,0))","v":23},{"$f":"LARGE(Scoreblad!$D$12:$D$43,ROW()-ROW($A$3)+1)","v":22.869565217391305},null,null,null,{"$f":"Scoreblad!B34","v":"Richard Smits"},{"$f":"SUMIF(Scoreblad!$E$7:$BX$7,$A$36,Scoreblad!E34:BX34)","v":0},{"$f":"SUMIF(Scoreblad!$E$7:$BX$7,$A$36,Scoreblad!F34:BY34)","v":0},null,null,{"$f":"Scoreblad!B36","v":"Ronald Mekes"},{"$f":"COUNTA(Scoreblad!BE36,Scoreblad!BI36,Scoreblad!BK36,Scoreblad!BM36,Scoreblad!BO36,Scoreblad!BG36)","v":1},{"$f":"IFERROR(SUM(Scoreblad!BJ36,Scoreblad!BH36,Scoreblad!BF36,Scoreblad!BL36,Scoreblad!BN36,Scoreblad!BP36)/COUNTA(Scoreblad!BE36,Scoreblad!BG36,Scoreblad!BI36,Scoreblad!BK36,Scoreblad!BM36,Scoreblad!BO36),\"\")","v":31}]
[{"$f":"INDEX(Scoreblad!$B$12:$B$43,MATCH(LARGE((Scoreblad!$D$12:$D$43)+ROW(Scoreblad!$D$12:$D$43)/1000,ROW()-ROW($A$3)+1),(Scoreblad!$D$12:$D$43)+ROW(Scoreblad!$D$12:$D$43)/1000,0))","v":"Anthony Laros"},{"$f":"INDEX(Scoreblad!$C$12:$C$43,MATCH(LARGE((Scoreblad!$D$12:$D$43)+ROW(Scoreblad!$D$12:$D$43)/1000,ROW()-ROW($A$3)+1),(Scoreblad!$D$12:$D$43)+ROW(Scoreblad!$D$12:$D$43)/1000,0))","v":15},{"$f":"LARGE(Scoreblad!$D$12:$D$43,ROW()-ROW($A$3)+1)","v":22.133333333333333},null,null,null,{"$f":"Scoreblad!B35","v":"Ringo Joannes"},{"$f":"SUMIF(Scoreblad!$E$7:$BX$7,$A$36,Scoreblad!E35:BX35)","v":0},{"$f":"SUMIF(Scoreblad!$E$7:$BX$7,$A$36,Scoreblad!F35:BY35)","v":0},null,null,{"$f":"Scoreblad!B37","v":"Sier van den Brand"},{"$f":"COUNTA(Scoreblad!BE37,Scoreblad!BI37,Scoreblad!BK37,Scoreblad!BM37,Scoreblad!BO37,Scoreblad!BG37)","v":5},{"$f":"IFERROR(SUM(Scoreblad!BJ37,Scoreblad!BH37,Scoreblad!BF37,Scoreblad!BL37,Scoreblad!BN37,Scoreblad!BP37)/COUNTA(Scoreblad!BE37,Scoreblad!BG37,Scoreblad!BI37,Scoreblad!BK37,Scoreblad!BM37,Scoreblad!BO37),\"\")","v":24.8}]
[{"$f":"INDEX(Scoreblad!$B$12:$B$43,MATCH(LARGE((Scoreblad!$D$12:$D$43)+ROW(Scoreblad!$D$12:$D$43)/1000,ROW()-ROW($A$3)+1),(Scoreblad!$D$12:$D$43)+ROW(Scoreblad!$D$12:$D$43)/1000,0))","v":"Patrick Laros"},{"$f":"INDEX(Scoreblad!$C$12:$C$43,MATCH(LARGE((Scoreblad!$D$12:$D$43)+ROW(Scoreblad!$D$12:$D$43)/1000,ROW()-ROW($A$3)+1),(Scoreblad!$D$12:$D$43)+ROW(Scoreblad!$D$12:$D$43)/1000,0))","v":14},{"$f":"LARGE(Scoreblad!$D$12:$D$43,ROW()-ROW($A$3)+1)","v":22.071428571428573},null,null,null,{"$f":"Scoreblad!B36","v":"Ronald Mekes"},{"$f":"SUMIF(Scoreblad!$E$7:$BX$7,$A$36,Scoreblad!E36:BX36)","v":11},{"$f":"SUMIF(Scoreblad!$E$7:$BX$7,$A$36,Scoreblad!F36:BY36)","v":11},null,null,{"$f":"Scoreblad!B38","v":"Tonnie Breeweg"},{"$f":"COUNTA(Scoreblad!BE38,Scoreblad!BI38,Scoreblad!BK38,Scoreblad!BM38,Scoreblad!BO38,Scoreblad!BG38)","v":2},{"$f":"IFERROR(SUM(Scoreblad!BJ38,Scoreblad!BH38,Scoreblad!BF38,Scoreblad!BL38,Scoreblad!BN38,Scoreblad!BP38)/COUNTA(Scoreblad!BE38,Scoreblad!BG38,Scoreblad!BI38,Scoreblad!BK38,Scoreblad!BM38,Scoreblad!BO38),\"\")","v":15}]
[{"$f":"INDEX(Scoreblad!$B$12:$B$43,MATCH(LARGE((Scoreblad!$D$12:$D$43)+ROW(Scoreblad!$D$12:$D$43)/1000,ROW()-ROW($A$3)+1),(Scoreblad!$D$12:$D$43)+ROW(Scoreblad!$D$12:$D$43)/1000,0))","v":"Sier van den Brand"},{"$f":"INDEX(Scoreblad!$C$12:$C$43,MATCH(LARGE((Scoreblad!$D$12:$D$43)+ROW(Scoreblad!$D$12:$D$43)/1000,ROW()-ROW($A$3)+1),(Scoreblad!$D$12:$D$43)+ROW(Scoreblad!$D$12:$D$43)/1000,0))","v":21},{"$f":"LARGE(Scoreblad!$D$12:$D$43,ROW()-ROW($A$3)+1)","v":22.047619047619047},null,null,null,{"$f":"Scoreblad!B37","v":"Sier van den Brand"},{"$f":"SUMIF(Scoreblad!$E$7:$BX$7,$A$36,Scoreblad!E37:BX37)","v":12},{"$f":"SUMIF(Scoreblad!$E$7:$BX$7,$A$36,Scoreblad!F37:BY37)","v":13},null,null,{"$f":"Scoreblad!B39","v":"Toon Melisse"},{"$f":"COUNTA(Scoreblad!BE39,Scoreblad!BI39,Scoreblad!BK39,Scoreblad!BM39,Scoreblad!BO39,Scoreblad!BG39)","v":4},{"$f":"IFERROR(SUM(Scoreblad!BJ39,Scoreblad!BH39,Scoreblad!BF39,Scoreblad!BL39,Scoreblad!BN39,Scoreblad!BP39)/COUNTA(Scoreblad!BE39,Scoreblad!BG39,Scoreblad!BI39,Scoreblad!BK39,Scoreblad!BM39,Scoreblad!BO39),\"\")","v":17.5}]
[{"$f":"INDEX(Scoreblad!$B$12:$B$43,MATCH(LARGE((Scoreblad!$D$12:$D$43)+ROW(Scoreblad!$D$12:$D$43)/1000,ROW()-ROW($A$3)+1),(Scoreblad!$D$12:$D$43)+ROW(Scoreblad!$D$12:$D$43)/1000,0))","v":"Pascal Mouthaan"},{"$f":"INDEX(Scoreblad!$C$12:$C$43,MATCH(LARGE((Scoreblad!$D$12:$D$43)+ROW(Scoreblad!$D$12:$D$43)/1000,ROW()-ROW($A$3)+1),(Scoreblad!$D$12:$D$43)+ROW(Scoreblad!$D$12:$D$43)/1000,0))","v":24},{"$f":"LARGE(Scoreblad!$D$12:$D$43,ROW()-ROW($A$3)+1)","v":21.75},null,null,null,{"$f":"Scoreblad!B38","v":"Tonnie Breeweg"},{"$f":"SUMIF(Scoreblad!$E$7:$BX$7,$A$36,Scoreblad!E38:BX38)","v":18},{"$f":"SUMIF(Scoreblad!$E$7:$BX$7,$A$36,Scoreblad!F38:BY38)","v":30},null,null,{"$f":"Scoreblad!B40","v":"Wally Gijzen"},{"$f":"COUNTA(Scoreblad!BE40,Scoreblad!BI40,Scoreblad!BK40,Scoreblad!BM40,Scoreblad!BO40,Scoreblad!BG40)","v":5},{"$f":"IFERROR(SUM(Scoreblad!BJ40,Scoreblad!BH40,Scoreblad!BF40,Scoreblad!BL40,Scoreblad!BN40,Scoreblad!BP40)/COUNTA(Scoreblad!BE40,Scoreblad!BG40,Scoreblad!BI40,Scoreblad!BK40,Scoreblad!BM40,Scoreblad!BO40),\"\")","v":23.8}]
[{"$f":"INDEX(Scoreblad!$B$12:$B$43,MATCH(LARGE((Scoreblad!$D$12:$D$43)+ROW(Scoreblad!$D$12:$D$43)/1000,ROW()-ROW($A$3)+1),(Scoreblad!$D$12:$D$43)+ROW(Scoreblad!$D$12:$D$43)/1000,0))","v":"Toon Melisse"},{"$f":"INDEX(Scoreblad!$C$12:$C$43,MATCH(LARGE((Scoreblad!$D$12:$D$43)+ROW(Scoreblad!$D$12:$D$43)/1000,ROW()-ROW($A$3)+1),(Scoreblad!$D$12:$D$43)+ROW(Scoreblad!$D$12:$D$43)/1000,0))","v":14},{"$f":"LARGE(Scoreblad!$D$12:$D$43,ROW()-ROW($A$3)+1)","v":20.714285714285715},null,null,null,{"$f":"Scoreblad!B39","v":"Toon Melisse"},{"$f":"SUMIF(Scoreblad!$E$7:$BX$7,$A$36,Scoreblad!E39:BX39)","v":0},{"$f":"SUMIF(Scoreblad!$E$7:$BX$7,$A$36,Scoreblad!F39:BY39)","v":0},null,null,{"$f":"Scoreblad!B41","v":"Walter Cats"},{"$f":"COUNTA(Scoreblad!BE41,Scoreblad!BI41,Scoreblad!BK41,Scoreblad!BM41,Scoreblad!BO41,Scoreblad!BG41)","v":5},{"$f":"IFERROR(SUM(Scoreblad!BJ41,Scoreblad!BH41,Scoreblad!BF41,Scoreblad!BL41,Scoreblad!BN41,Scoreblad!BP41)/COUNTA(Scoreblad!BE41,Scoreblad!BG41,Scoreblad!BI41,Scoreblad!BK41,Scoreblad!BM41,Scoreblad!BO41),\"\")","v":29.8}]
[{"$f":"INDEX(Scoreblad!$B$12:$B$43,MATCH(LARGE((Scoreblad!$D$12:$D$43)+ROW(Scoreblad!$D$12:$D$43)/1000,ROW()-ROW($A$3)+1),(Scoreblad!$D$12:$D$43)+ROW(Scoreblad!$D$12:$D$43)/1000,0))","v":"Eddy vd Tuijn"},{"$f":"INDEX(Scoreblad!$C$12:$C$43,MATCH(LARGE((Scoreblad!$D$12:$D$43)+ROW(Scoreblad!$D$12:$D$43)/1000,ROW()-ROW($A$3)+1),(Scoreblad!$D$12:$D$43)+ROW(Scoreblad!$D$12:$D$43)/1000,0))","v":22},{"$f":"LARGE(Scoreblad!$D$12:$D$43,ROW()-ROW($A$3)+1)","v":20.454545454545453},null,null,null,{"$f":"Scoreblad!B40","v":"Wally Gijzen"},{"$f":"SUMIF(Scoreblad!$E$7:$BX$7,$A$36,Scoreblad!E40:BX40)","v":17},{"$f":"SUMIF(Scoreblad!$E$7:$BX$7,$A$36,Scoreblad!F40:BY40)","v":23},null,null,{"$f":"Scoreblad!B42","v":"Wappie Broermann"},{"$f":"COUNTA(Scoreblad!BE42,Scoreblad!BI42,Scoreblad!BK42,Scoreblad!BM42,Scoreblad!BO42,Scoreblad!BG42)","v":4},{"$f":"IFERROR(SUM(Scoreblad!BJ42,Scoreblad!BH42,Scoreblad!BF42,Scoreblad!BL42,Scoreblad!BN42,Scoreblad!BP42)/COUNTA(Scoreblad!BE42,Scoreblad!BG42,Scoreblad!BI42,Scoreblad!BK42,Scoreblad!BM42,Scoreblad!BO42),\"\")","v":25.25}]
[{"$f":"INDEX(Scoreblad!$B$12:$B$43,MATCH(LARGE((Scoreblad!$D$12:$D$43)+ROW(Scoreblad!$D$12:$D$43)/1000,ROW()-ROW($A$3)+1),(Scoreblad!$D$12:$D$43)+ROW(Scoreblad!$D$12:$D$43)/1000,0))","v":"Jef van Noort"},{"$f":"INDEX(Scoreblad!$C$12:$C$43,MATCH(LARGE((Scoreblad!$D$12:$D$43)+ROW(Scoreblad!$D$12:$D$43)/1000,ROW()-ROW($A$3)+1),(Scoreblad!$D$12:$D$43)+ROW(Scoreblad!$D$12:$D$43)/1000,0))","v":11},{"$f":"LARGE(Scoreblad!$D$12:$D$43,ROW()-ROW($A$3)+1)","v":19.363636363636363},null,null,null,{"$f":"Scoreblad!B41","v":"Walter Cats"},{"$f":"SUMIF(Scoreblad!$E$7:$BX$7,$A$36,Scoreblad!E41:BX41)","v":16},{"$f":"SUMIF(Scoreblad!$E$7:$BX$7,$A$36,Scoreblad!F41:BY41)","v":21},null,null,{"$f":"Scoreblad!B43","v":"Wilco van den Oever"},{"$f":"COUNTA(Scoreblad!BE43,Scoreblad!BI43,Scoreblad!BK43,Scoreblad!BM43,Scoreblad!BO43,Scoreblad!BG43)","v":5},{"$f":"IFERROR(SUM(Scoreblad!BJ43,Scoreblad!BH43,Scoreblad!BF43,Scoreblad!BL43,Scoreblad!BN43,Scoreblad!BP43)/COUNTA(Scoreblad!BE43,Scoreblad!BG43,Scoreblad!BI43,Scoreblad!BK43,Scoreblad!BM43,Scoreblad!BO43),\"\")","v":24.4}]
[{"$f":"INDEX(Scoreblad!$B$12:$B$43,MATCH(LARGE((Scoreblad!$D$12:$D$43)+ROW(Scoreblad!$D$12:$D$43)/1000,ROW()-ROW($A$3)+1),(Scoreblad!$D$12:$D$43)+ROW(Scoreblad!$D$12:$D$43)/1000,0))","v":"Pieter de Bot"},{"$f":"INDEX(Scoreblad!$C$12:$C$43,MATCH(LARGE((Scoreblad!$D$12:$D$43)+ROW(Scoreblad!$D$12:$D$43)/1000,ROW()-ROW($A$3)+1),(Scoreblad!$D$12:$D$43)+ROW(Scoreblad!$D$12:$D$43)/1000,0))","v":14},{"$f":"LARGE(Scoreblad!$D$12:$D$43,ROW()-ROW($A$3)+1)","v":18},null,null,null,{"$f":"Scoreblad!B42","v":"Wappie Broermann"},{"$f":"SUMIF(Scoreblad!$E$7:$BX$7,$A$36,Scoreblad!E42:BX42)","v":14},{"$f":"SUMIF(Scoreblad!$E$7:$BX$7,$A$36,Scoreblad!F42:BY42)","v":17},null,null,{"$f":"Scoreblad!B15","v":"Boudewijn v/d Plas"},{"$f":"COUNTA(Scoreblad!#REF!,Scoreblad!#REF!,Scoreblad!#REF!,Scoreblad!#REF!,Scoreblad!#REF!,Scoreblad!#REF!)","v":6}]
[{"$f":"INDEX(Scoreblad!$B$12:$B$43,MATCH(LARGE((Scoreblad!$D$12:$D$43)+ROW(Scoreblad!$D$12:$D$43)/1000,ROW()-ROW($A$3)+1),(Scoreblad!$D$12:$D$43)+ROW(Scoreblad!$D$12:$D$43)/1000,0))","v":"Ringo Joannes"},{"$f":"INDEX(Scoreblad!$C$12:$C$43,MATCH(LARGE((Scoreblad!$D$12:$D$43)+ROW(Scoreblad!$D$12:$D$43)/1000,ROW()-ROW($A$3)+1),(Scoreblad!$D$12:$D$43)+ROW(Scoreblad!$D$12:$D$43)/1000,0))","v":11},{"$f":"LARGE(Scoreblad!$D$12:$D$43,ROW()-ROW($A$3)+1)","v":17},null,null,null,{"$f":"Scoreblad!B43","v":"Wilco van den Oever"},{"$f":"SUMIF(Scoreblad!$E$7:$BX$7,$A$36,Scoreblad!E43:BX43)","v":12},{"$f":"SUMIF(Scoreblad!$E$7:$BX$7,$A$36,Scoreblad!F43:BY43)","v":13},null,null,{"$f":"Scoreblad!#REF!","v":{"$error":"#REF!"}},{"$f":"COUNTA(Scoreblad!#REF!,Scoreblad!#REF!,Scoreblad!#REF!,Scoreblad!#REF!,Scoreblad!#REF!,Scoreblad!#REF!)","v":6}]
[]
[{"$f":"Totalen!$N$1&DATA!H2","v":"43Stb"},{"$f":"Totalen!$N$1&DATA!I2","v":"43Pnt"}]

{"sheet":"Blad1","index":5,"n_rows":0,"n_cols":0,"rows_kept":0,"cut":false,"hidden":false,"merged":[]}