{"text_format":"1","workbook":"xlsx","n_sheets":6,"sheets":["Totalen","Blad7","Scoreblad","Gasten","DATA","Blad1"],"not_rendered":{"charts":0,"images":1,"macros":1,"external_links":0,"defined_names":4,"comments":0,"pivot_tables":1},"unopened":[],"bounds":{"document_bytes":16777216,"sheet_cells":100000,"rows_first":2000,"rows_last":500,"rows_between":2000,"halvings":0,"cell_chars":16384,"cell_head_chars":4096},"cells_cut":0,"cells_raw":0,"read":"whole","date_system":"1900"}

{"sheet":"Totalen","index":0,"n_rows":33,"n_cols":14,"rows_kept":33,"cut":false,"hidden":false,"merged":[[0,3,0,4]]}
["Naam","#","Score",null,null,null,"Naam","Stb","Pnt",null,null,null,"Weeknummer",43]
[{"$f":"INDEX(Scoreblad!$B$12:$B$43,MATCH(LARGE((Scoreblad!$D$12:$D$43)+ROW(Scoreblad!$D$12:$D$43)/1000,ROW()-ROW($A$2)+1),(Scoreblad!$D$12:$D$43)+ROW(Scoreblad!$D$12:$D$43)/1000,0))","v":"Walter Cats"},{"$f":"INDEX(Scoreblad!$C$12:$C$43,MATCH(LARGE((Scoreblad!$D$12:$D$43)+ROW(Scoreblad!$D$12:$D$43)/1000,ROW()-ROW($A$2)+1),(Scoreblad!$D$12:$D$43)+ROW(Scoreblad!$D$12:$D$43)/1000,0))","v":26},{"$f":"LARGE(Scoreblad!$D$12:$D$43,ROW()-ROW($A$2)+1)","v":28.153846153846153},null,null,null,{"$f":"INDEX(DATA!$G$3:$G$34,MATCH(LARGE((DATA!$I$3:$I$34)+ROW(DATA!$I$3:$I$34)/1000,ROW()-ROW($G$2)+1),(DATA!$I$3:$I$34)+ROW(DATA!$I$3:$I$34)/1000,0))","v":"Jos Bergmans"},{"$f":"INDEX(DATA!$H$3:$H$34,MATCH(LARGE((DATA!$I$3:$I$34)+ROW(DATA!$I$3:$I$34)/1000,ROW()-ROW($G$2)+1),(DATA!$I$3:$I$34)+ROW(DATA!$I$3:$I$34)/1000,0))","v":20},{"$f":"LARGE(DATA!$I$3:$I$34,ROW()-ROW($G$2)+1)","v":32}]
[{"$f":"INDEX(Scoreblad!$B$12:$B$43,MATCH(LARGE((Scoreblad!$D$12:$D$43)+ROW(Scoreblad!$D$12:$D$43)/1000,ROW()-ROW($A$2)+1),(Scoreblad!$D$12:$D$43)+ROW(Scoreblad!$D$12:$D$43)/1000,0))","v":"Paul Nijmeijer"},{"$f":"INDEX(Scoreblad!$C$12:$C$43,MATCH(LARGE((Scoreblad!$D$12:$D$43)+ROW(Scoreblad!$D$12:$D$43)/1000,ROW()-ROW($A$2)+1),(Scoreblad!$D$12:$D$43)+ROW(Scoreblad!$D$12:$D$43)/1000,0))","v":22},{"$f":"LARGE(Scoreblad!$D$12:$D$43,ROW()-ROW($A$2)+1)","v":27.09090909090909},null,null,null,{"$f":"INDEX(DATA!$G$3:$G$34,MATCH(LARGE((DATA!$I$3:$I$34)+ROW(DATA!$I$3:$I$34)/1000,ROW()-ROW($G$2)+1),(DATA!$I$3:$I$34)+ROW(DATA!$I$3:$I$34)/1000,0))","v":"Guust v/d Bemd"},{"$f":"INDEX(DATA!$H$3:$H$34,MATCH(LARGE((DATA!$I$3:$I$34)+ROW(DATA!$I$3:$I$34)/1000,ROW()-ROW($G$2)+1),(DATA!$I$3:$I$34)+ROW(DATA!$I$3:$I$34)/1000,0))","v":19},{"$f":"LARGE(DATA!$I$3:$I$34,ROW()-ROW($G$2)+1)","v":31}]
[{"$f":"INDEX(Scoreblad!$B$12:$B$43,MATCH(LARGE((Scoreblad!$D$12:$D$43)+ROW(Scoreblad!$D$12:$D$43)/1000,ROW()-ROW($A$2)+1),(Scoreblad!$D$12:$D$43)+ROW(Scoreblad!$D$12:$D$43)/1000,0))","v":"Michiel Vroon"},{"$f":"INDEX(Scoreblad!$C$12:$C$43,MATCH(LARGE((Scoreblad!$D$12:$D$43)+ROW(Scoreblad!$D$12:$D$43)/1000,ROW()-ROW($A$2)+1),(Scoreblad!$D$12:$D$43)+ROW(Scoreblad!$D$12:$D$43)/1000,0))","v":18},{"$f":"LARGE(Scoreblad!$D$12:$D$43,ROW()-ROW($A$2)+1)","v":26.444444444444443},null,null,null,{"$f":"INDEX(DATA!$G$3:$G$34,MATCH(LARGE((DATA!$I$3:$I$34)+ROW(DATA!$I$3:$I$34)/1000,ROW()-ROW($G$2)+1),(DATA!$I$3:$I$34)+ROW(DATA!$I$3:$I$34)/1000,0))","v":"Tonnie Breeweg"},{"$f":"INDEX(DATA!$H$3:$H$34,MATCH(LARGE((DATA!$I$3:$I$34)+ROW(DATA!$I$3:$I$34)/1000,ROW()-ROW($G$2)+1),(DATA!$I$3:$I$34)+ROW(DATA!$I$3:$I$34)/1000,0))","v":18},{"$f":"LARGE(DATA!$I$3:$I$34,ROW()-ROW($G$2)+1)","v":30}]
[{"$f":"INDEX(Scoreblad!$B$12:$B$43,MATCH(LARGE((Scoreblad!$D$12:$D$43)+ROW(Scoreblad!$D$12:$D$43)/1000,ROW()-ROW($A$2)+1),(Scoreblad!$D$12:$D$43)+ROW(Scoreblad!$D$12:$D$43)/1000,0))","v":"Daan vd Tuijn"},{"$f":"INDEX(Scoreblad!$C$12:$C$43,MATCH(LARGE((Scoreblad!$D$12:$D$43)+ROW(Scoreblad!$D$12:$D$43)/1000,ROW()-ROW($A$2)+1),(Scoreblad!$D$12:$D$43)+ROW(Scoreblad!$D$12:$D$43)/1000,0))","v":21},{"$f":"LARGE(Scoreblad!$D$12:$D$43,ROW()-ROW($A$2)+1)","v":26.285714285714285},null,null,null,{"$f":"INDEX(DATA!$G$3:$G$34,MATCH(LARGE((DATA!$I$3:$I$34)+ROW(DATA!$I$3:$I$34)/1000,ROW()-ROW($G$2)+1),(DATA!$I$3:$I$34)+ROW(DATA!$I$3:$I$34)/1000,0))","v":"Paul Nijmeijer"},{"$f":"INDEX(DATA!$H$3:$H$34,MATCH(LARGE((DATA!$I$3:$I$34)+ROW(DATA!$I$3:$I$34)/1000,ROW()-ROW($G$2)+1),(DATA!$I$3:$I$34)+ROW(DATA!$I$3:$I$34)/1000,0))","v":18},{"$f":"LARGE(DATA!$I$3:$I$34,ROW()-ROW($G$2)+1)","v":30}]
[{"$f":"INDEX(Scoreblad!$B$12:$B$43,MATCH(LARGE((Scoreblad!$D$12:$D$43)+ROW(Scoreblad!$D$12:$D$43)/1000,ROW()-ROW($A$2)+1),(Scoreblad!$D$12:$D$43)+ROW(Scoreblad!$D$12:$D$43)/1000,0))","v":"Jan Hoogstrate"},{"$f":"INDEX(Scoreblad!$C$12:$C$43,MATCH(LARGE((Scoreblad!$D$12:$D$43)+ROW(Scoreblad!$D$12:$D$43)/1000,ROW()-ROW($A$2)+1),(Scoreblad!$D$12:$D$43)+ROW(Scoreblad!$D$12:$D$43)/1000,0))","v":25},{"$f":"LARGE(Scoreblad!$D$12:$D$43,ROW()-ROW($A$2)+1)","v":26},null,null,null,{"$f":"INDEX(DATA!$G$3:$G$34,MATCH(LARGE((DATA!$I$3:$I$34)+ROW(DATA!$I$3:$I$34)/1000,ROW()-ROW($G$2)+1),(DATA!$I$3:$I$34)+ROW(DATA!$I$3:$I$34)/1000,0))","v":"Maurice van Berkel"},{"$f":"INDEX(DATA!$H$3:$H$34,MATCH(LARGE((DATA!$I$3:$I$34)+ROW(DATA!$I$3:$I$34)/1000,ROW()-ROW($G$2)+1),(DATA!$I$3:$I$34)+ROW(DATA!$I$3:$I$34)/1000,0))","v":18},{"$f":"LARGE(DATA!$I$3:$I$34,ROW()-ROW($G$2)+1)","v":30}]
[{"$f":"INDEX(Scoreblad!$B$12:$B$43,MATCH(LARGE((Scoreblad!$D$12:$D$43)+ROW(Scoreblad!$D$12:$D$43)/1000,ROW()-ROW($A$2)+1),(Scoreblad!$D$12:$D$43)+ROW(Scoreblad!$D$12:$D$43)/1000,0))","v":"Jan Bierbooms"},{"$f":"INDEX(Scoreblad!$C$12:$C$43,MATCH(LARGE((Scoreblad!$D$12:$D$43)+ROW(Scoreblad!$D$12:$D$43)/1000,ROW()-ROW($A$2)+1),(Scoreblad!$D$12:$D$43)+ROW(Scoreblad!$D$12:$D$43)/1000,0))","v":25},{"$f":"LARGE(Scoreblad!$D$12:$D$43,ROW()-ROW($A$2)+1)","v":25.88},null,null,null,{"$f":"INDEX(DATA!$G$3:$G$34,MATCH(LARGE((DATA!$I$3:$I$34)+ROW(DATA!$I$3:$I$34)/1000,ROW()-ROW($G$2)+1),(DATA!$I$3:$I$34)+ROW(DATA!$I$3:$I$34)/1000,0))","v":"Maarten Kaas"},{"$f":"INDEX(DATA!$H$3:$H$34,MATCH(LARGE((DATA!$I$3:$I$34)+ROW(DATA!$I$3:$I$34)/1000,ROW()-ROW($G$2)+1),(DATA!$I$3:$I$34)+ROW(DATA!$I$3:$I$34)/1000,0))","v":18},{"$f":"LARGE(DATA!$I$3:$I$34,ROW()-ROW($G$2)+1)","v":30}]
[{"$f":"INDEX(Scoreblad!$B$12:$B$43,MATCH(LARGE((Scoreblad!$D$12:$D$43)+ROW(Scoreblad!$D$12:$D$43)/1000,ROW()-ROW($A$2)+1),(Scoreblad!$D$12:$D$43)+ROW(Scoreblad!$D$12:$D$43)/1000,0))","v":"Boudewijn v/d Plas"},{"$f":"INDEX(Scoreblad!$C$12:$C$43,MATCH(LARGE((Scoreblad!$D$12:$D$43)+ROW(Scoreblad!$D$12:$D$43)/1000,ROW()-ROW($A$2)+1),(Scoreblad!$D$12:$D$43)+ROW(Scoreblad!$D$12:$D$43)/1000,0))","v":21},{"$f":"LARGE(Scoreblad!$D$12:$D$43,ROW()-ROW($A$2)+1)","v":25.476190476190474},null,null,null,{"$f":"INDEX(DATA!$G$3:$G$34,MATCH(LARGE((DATA!$I$3:$I$34)+ROW(DATA!$I$3:$I$34)/1000,ROW()-ROW($G$2)+1),(DATA!$I$3:$I$34)+ROW(DATA!$I$3:$I$34)/1000,0))","v":"Jan Hoogstrate"},{"$f":"INDEX(DATA!$H$3:$H$34,MATCH(LARGE((DATA!$I$3:$I$34)+ROW(DATA!$I$3:$I$34)/1000,ROW()-ROW($G$2)+1),(DATA!$I$3:$I$34)+ROW(DATA!$I$3:$I$34)/1000,0))","v":18},{"$f":"LARGE(DATA!$I$3:$I$34,ROW()-ROW($G$2)+1)","v":30}]
[{"$f":"INDEX(Scoreblad!$B$12:$B$43,MATCH(LARGE((Scoreblad!$D$12:$D$43)+ROW(Scoreblad!$D$12:$D$43)/1000,ROW()-ROW($A$2)+1),(Scoreblad!$D$12:$D$43)+ROW(Scoreblad!$D$12:$D$43)/1000,0))","v":"Richard Smits"},{"$f":"INDEX(Scoreblad!$C$12:$C$43,MATCH(LARGE((Scoreblad!$D$12:$D$43)+ROW(Scoreblad!$D$12:$D$43)/1000,ROW()-ROW($A$2)+1),(Scoreblad!$D$12:$D$43)+ROW(Scoreblad!$D$12:$D$43)/1000,0))","v":20},{"$f":"LARGE(Scoreblad!$D$12:$D$43,ROW()-ROW($A$2)+1)","v":25.4},null,null,null,{"$f":"INDEX(DATA!$G$3:$G$34,MATCH(LARGE((DATA!$I$3:$I$34)+ROW(DATA!$I$3:$I$34)/1000,ROW()-ROW($G$2)+1),(DATA!$I$3:$I$34)+ROW(DATA!$I$3:$I$34)/1000,0))","v":"Dre Verhoef"},{"$f":"INDEX(DATA!$H$3:$H$34,MATCH(LARGE((DATA!$I$3:$I$34)+ROW(DATA!$I$3:$I$34)/1000,ROW()-ROW($G$2)+1),(DATA!$I$3:$I$34)+ROW(DATA!$I$3:$I$34)/1000,0))","v":18},{"$f":"LARGE(DATA!$I$3:$I$34,ROW()-ROW($G$2)+1)","v":30}]
[{"$f":"INDEX(Scoreblad!$B$12:$B$43,MATCH(LARGE((Scoreblad!$D$12:$D$43)+ROW(Scoreblad!$D$12:$D$43)/1000,ROW()-ROW($A$2)+1),(Scoreblad!$D$12:$D$43)+ROW(Scoreblad!$D$12:$D$43)/1000,0))","v":"Tonnie Breeweg"},{"$f":"INDEX(Scoreblad!$C$12:$C$43,MATCH(LARGE((Scoreblad!$D$12:$D$43)+ROW(Scoreblad!$D$12:$D$43)/1000,ROW()-ROW($A$2)+1),(Scoreblad!$D$12:$D$43)+ROW(Scoreblad!$D$12:$D$43)/1000,0))","v":21},{"$f":"LARGE(Scoreblad!$D$12:$D$43,ROW()-ROW($A$2)+1)","v":25.238095238095237},null,null,null,{"$f":"INDEX(DATA!$G$3:$G$34,MATCH(LARGE((DATA!$I$3:$I$34)+ROW(DATA!$I$3:$I$34)/1000,ROW()-ROW($G$2)+1),(DATA!$I$3:$I$34)+ROW(DATA!$I$3:$I$34)/1000,0))","v":"Boudewijn v/d Plas"},{"$f":"INDEX(DATA!$H$3:$H$34,MATCH(LARGE((DATA!$I$3:$I$34)+ROW(DATA!$I$3:$I$34)/1000,ROW()-ROW($G$2)+1),(DATA!$I$3:$I$34)+ROW(DATA!$I$3:$I$34)/1000,0))","v":18},{"$f":"LARGE(DATA!$I$3:$I$34,ROW()-ROW($G$2)+1)","v":30}]
{"$rows_left_out":24}
{"sheet":"Blad7","index":1,"n_rows":35,"n_cols":3,"rows_kept":35,"cut":false,"hidden":true,"merged":[]}
[]
[]
[]
["Rijlabels","Som van Kolom5","Som van Kolom7"]
["Anthony Laros",5,5]
["Arthur Hopstaken",23,26]
["Bart de Bot",11,13]
["Daan vd Tuijn",19,19]
["Dre Verhoef",27,1]
["Eddy vd Tuijn",29,11]
{"$rows_left_out":26}
{"sheet":"Scoreblad","index":2,"n_rows":43,"n_cols":76,"rows_kept":43,"cut":false,"hidden":false,"merged":[[8,56,8,59],[8,52,8,55],[8,50,8,51],[8,28,8,29],[8,30,8,31],[8,32,8,33],[8,34,8,35],[8,36,8,37],[8,38,8,39],[8,40,8,41],[8,42,8,43],[8,44,8,45],[8,46,8,47],[8,48,8,49],[8,26,8,27],[8,4,8,5],[8,6,8,7],[8,8,8,9],[8,10,8,11],[8,12,8,13],[8,14,8,15],[8,16,8,17],[8,18,8,19],[8,20,8,21],[8,22,8,23],[8,24,8,25],[7,28,7,29],[7,30,7,31],[7,4,7,5],[7,6,7,7],[7,8,7,9],[7,10,7,11],[7,12,7,13],[7,14,7,15],[7,16,7,17],[7,18,7,19],[7,20,7,21],[7,22,7,23],[7,24,7,25],[7,26,7,27],[7,32,7,33],[7,34,7,35],[7,36,7,37],[7,38,7,39],[7,40,7,41],[7,42,7,43],[7,44,7,45],[7,46,7,47],[7,48,7,49],[7,50,7,51],[7,52,7,53],[7,54,7,55],[7,56,7,57],[7,68,7,69],[7,70,7,71],[7,58,7,59],[7,72,7,73],[7,74,7,75],[8,60,8,63],[7,60,7,61],[7,62,7,63],[7,64,7,65],[7,66,7,67],[8,74,8,75],[8,72,8,73],[8,64,8,65],[8,66,8,67],[8,68,8,69],[8,70,8,71]]}
[]
[]
[]
[]
[]
[]
[null,null,null,null,{"$f":"WEEKNUM(E9,1)&E10","v":"14Stb"},{"$f":"WEEKNUM(E9,1)&F10","v":"14Pnt"},{"$f":"WEEKNUM(G9,1)&G10","v":"15Stb"},{"$f":"WEEKNUM(G9,1)&H10","v":"15Pnt"},{"$f":"WEEKNUM(I9,1)&I10","v":"16Stb"},{"$f":"WEEKNUM(I9,1)&J10","v":"16Pnt"},{"$f":"WEEKNUM(K9,1)&K10","v":"17Stb"},{"$f":"WEEKNUM(K9,1)&L10","v":"17Pnt"},"18Stb","18Pnt","19Stb","19Pnt","20Stb","20Pnt","21Stb","21Pnt","22Stb","22Pnt","23Stb","23Pnt","24Stb","24Pnt","25Stb","25Pnt","26Stb","26Pnt","27Stb","27Pnt","28Stb","28Pnt","29Stb","29Pnt","30Stb","30Pnt","31Stb","31Pnt","32Stb","32Pnt","33Stb","33Pnt","34Stb","34Pnt","35Stb","35Pnt","36Stb","36Pnt","37Stb","37Pnt","38Stb","38Pnt","0Stb","0Pnt",{"$f":"BE8&BE10","v":"DATW3Stb"},{"$f":"BE8&BF10","v":"DATW3Pnt"},{"$f":"BG8&BG10","v":"DATW4Stb"},{"$f":"BG8&BH10","v":"DATW4Pnt"},{"$f":"BI8&BI10","v":"DATW5Stb"},{"$f":"BI8&BJ10","v":"DATW5Pnt"},{"$f":"BK8&BK10","v":"DATW6Stb"},{"$f":"BK8&BL10","v":"DATW6Pnt"},{"$f":"BM8&BM10","v":"39Stb"},{"$f":"BM8&BN10","v":"39Pnt"},{"$f":"BO8&BO10","v":"40Stb"},{"$f":"BO8&BP10","v":"40Pnt"},"41Stb","41Pnt","42Stb","42Pnt","43Stb","43Pnt","44Stb","44Pnt"]
[33,null,null,"Week",{"$f":"WEEKNUM(E9)","v":14},null,{"$f":"WEEKNUM(G9)","v":15},null,{"$f":"WEEKNUM(I9)","v":16},null,{"$f":"WEEKNUM(K9)","v":17},null,{"$f":"WEEKNUM(M9)","v":18},null,{"$f":"WEEKNUM(O9)","v":19},null,{"$f":"WEEKNUM(Q9)","v":20},null,{"$f":"WEEKNUM(S9)","v":21},null,{"$f":"WEEKNUM(U9)","v":22},null,{"$f":"WEEKNUM(W9)","v":23},null,{"$f":"WEEKNUM(Y9)","v":24},null,{"$f":"WEEKNUM(AA9)","v":25},null,{"$f":"WEEKNUM(AC9)","v":26},null,{"$f":"WEEKNUM(AE9)","v":27},null,{"$f":"WEEKNUM(AG9)","v":28},null,{"$f":"WEEKNUM(AI9)","v":29},null,{"$f":"WEEKNUM(AK9)","v":30},null,{"$f":"WEEKNUM(AM9)","v":31},null,{"$f":"WEEKNUM(AO9)","v":32},null,{"$f":"WEEKNUM(AQ9)","v":33},null,{"$f":"WEEKNUM(AS9)","v":34},null,{"$f":"WEEKNUM(AU9)","v":35},null,{"$f":"WEEKNUM(AW9)","v":36},null,{"$f":"WEEKNUM(AY9)","v":37},null,"DATW1",null,"DATW2",null,"DATW3",null,"DATW4",null,"DATW5",null,"DATW6",null,{"$f":"WEEKNUM(BM9)","v":39},null,40,null,{"$f":"WEEKNUM(BQ9)","v":41},null,{"$f":"WEEKNUM(BS9)","v":42},null,{"$f":"WEEKNUM(BU9)","v":43},null,{"$f":"WEEKNUM(BW9)","v":44}]
[null,null,null,"Datum","2021-04-01",null,{"$f":"E9+7","v":"2021-04-08"},null,{"$f":"G9+7","v":"2021-04-15"},null,{"$f":"I9+7","v":"2021-04-22"},null,{"$f":"K9+7","v":"2021-04-29"},null,{"$f":"M9+7","v":"2021-05-06"},null,{"$f":"O9+7","v":"2021-05-13"},null,{"$f":"Q9+7","v":"2021-05-20"},null,{"$f":"S9+7","v":"2021-05-27"},null,{"$f":"U9+7","v":"2021-06-03"},null,{"$f":"W9+7","v":"2021-06-10"},null,{"$f":"Y9+7","v":"2021-06-17"},null,{"$f":"AA9+7","v":"2021-06-24"},null,{"$f":"AC9+7","v":"2021-07-01"},null,{"$f":"AE9+7","v":"2021-07-08"},null,{"$f":"AG9+7","v":"2021-07-15"},null,{"$f":"AI9+7","v":"2021-07-22"},null,{"$f":"AK9+7","v":"2021-07-29"},null,{"$f":"AM9+7","v":"2021-08-05"},null,{"$f":"AO9+7","v":"2021-08-12"},null,{"$f":"AQ9+7","v":"2021-08-19"},null,{"$f":"AS9+7","v":"2021-08-26"},null,{"$f":"AU9+7","v":"2021-09-02"},null,{"$f":"AW9+7","v":"2021-09-09"},null,{"$f":"AY9+7","v":"2021-09-16"},null,null,null,"2019-09-17",null,null,null,{"$f":"BE9+1","v":"2019-09-18"},null,null,null,{"$f":"BA9+7","v":"2021-09-23"},null,{"$f":"BM9+7","v":"2021-09-30"},null,{"$f":"BO9+7","v":"2021-10-07"},null,{"$f":"BQ9+7","v":"2021-10-14"},null,{"$f":"BS9+7","v":"2021-10-21"},null,{"$f":"BU9+7","v":"2021-10-28"}]
[null,"Naam","Opkomsten","Gemiddelde","Stb","Pnt","Stb","Pnt","Stb","Pnt","Stb","Pnt","Stb","Pnt","Stb","Pnt","Stb","Pnt","Stb","Pnt","Stb","Pnt","Stb","Pnt","Stb","Pnt","Stb","Pnt","Stb","Pnt","Stb","Pnt","Stb","Pnt","Stb","Pnt","Stb","Pnt","Stb","Pnt","Stb","Pnt","Stb","Pnt","Stb","Pnt","Stb","Pnt","Stb","Pnt","Stb","Pnt","Stb","Pnt","Stb","Pnt","Stb","Pnt","Stb","Pnt","Stb","Pnt","Stb","Pnt","Stb","Pnt","Stb","Pnt","Stb","Pnt","Stb","Pnt","Stb","Pnt","Stb","Pnt"]
{"$rows_left_out":34}
{"sheet":"Gasten","index":3,"n_rows":24,"n_cols":2,"rows_kept":24,"cut":false,"hidden":false,"merged":[]}
[]
["Naam","Aantal"]
["arnold sulkers",13]
["arnold sulkers",16]
["arnold sulkers",12]
["arnold  sulkers",14]
["arnold",16]
["serge roks",13]
["arnold siulkers",14]
["roel elshout",10]
{"$rows_left_out":15}
{"sheet":"DATA","index":4,"n_rows":36,"n_cols":14,"rows_kept":36,"cut":false,"hidden":false,"merged":[]}
[null,null,null,null,null,null,null,null,null,null,null,"Weekend"]
["Naam","#","Gem.",null,null,null,"Naam","Stb","Pnt",null,null,"Naam","#","Gem."]
[{"$f":"INDEX(Scoreblad!$B$12:$B$43,MATCH(LARGE((Scoreblad!$D$12:$D$43)+ROW(Scoreblad!$D$12:$D$43)/1000,ROW()-ROW($A$3)+1),(Scoreblad!$D$12:$D$43)+ROW(Scoreblad!$D$12:$D$43)/1000,0))","v":"Walter Cats"},{"$f":"INDEX(Scoreblad!$C$12:$C$43,MATCH(LARGE((Scoreblad!$D$12:$D$43)+ROW(Scoreblad!$D$12:$D$43)/1000,ROW()-ROW($A$3)+1),(Scoreblad!$D$12:$D$43)+ROW(Scoreblad!$D$12:$D$43)/1000,0))","v":26},{"$f":"LARGE(Scoreblad!$D$12:$D$43,ROW()-ROW($A$3)+1)","v":28.153846153846153},null,null,null,{"$f":"Scoreblad!B12","v":"Anthony Laros"},{"$f":"SUMIF(Scoreblad!$E$7:$BX$7,$A$36,Scoreblad!E12:BX12)","v":17},{"$f":"SUMIF(Scoreblad!$E$7:$BX$7,$A$36,Scoreblad!F12:BY12)","v":23},null,null,{"$f":"Scoreblad!B12","v":"Anthony Laros"},{"$f":"COUNTA(Scoreblad!BE12,Scoreblad!BI12,Scoreblad!BK12,Scoreblad!BM12,Scoreblad!BO12,Scoreblad!BG12)","v":3},{"$f":"IFERROR(SUM(Scoreblad!BJ12,Scoreblad!BH12,Scoreblad!BF12,Scoreblad!BL12,Scoreblad!BN12,Scoreblad!BP12)/COUNTA(Scoreblad!BE12,Scoreblad!BG12,Scoreblad!BI12,Scoreblad!BK12,Scoreblad!BM12,Scoreblad!BO12),\"\")","v":14}]
[{"$f":"INDEX(Scoreblad!$B$12:$B$43,MATCH(LARGE((Scoreblad!$D$12:$D$43)+ROW(Scoreblad!$D$12:$D$43)/1000,ROW()-ROW($A$3)+1),(Scoreblad!$D$12:$D$43)+ROW(Scoreblad!$D$12:$D$43)/1000,0))","v":"Paul Nijmeijer"},{"$f":"INDEX(Scoreblad!$C$12:$C$43,MATCH(LARGE((Scoreblad!$D$12:$D$43)+ROW(Scoreblad!$D$12:$D$43)/1000,ROW()-ROW($A$3)+1),(Scoreblad!$D$12:$D$43)+ROW(Scoreblad!$D$12:$D$43)/1000,0))","v":22},{"$f":"LARGE(Scoreblad!$D$12:$D$43,ROW()-ROW($A$3)+1)","v":27.09090909090909},null,null,null,{"$f":"Scoreblad!B13","v":"Arthur Hopstaken"},{"$f":"SUMIF(Scoreblad!$E$7:$BX$7,$A$36,Scoreblad!E13:BX13)","v":0},{"$f":"SUMIF(Scoreblad!$E$7:$BX$7,$A$36,Scoreblad!F13:BY13)","v":0},null,null,{"$f":"Scoreblad!B13","v":"Arthur Hopstaken"},{"$f":"COUNTA(Scoreblad!BE13,Scoreblad!BI13,Scoreblad!BK13,Scoreblad!BM13,Scoreblad!BO13,Scoreblad!BG13)","v":5},{"$f":"IFERROR(SUM(Scoreblad!BJ13,Scoreblad!BH13,Scoreblad!BF13,Scoreblad!BL13,Scoreblad!BN13,Scoreblad!BP13)/COUNTA(Scoreblad!BE13,Scoreblad!BG13,Scoreblad!BI13,Scoreblad!BK13,Scoreblad!BM13,Scoreblad!BO13),\"\")","v":21}]
[{"$f":"INDEX(Scoreblad!$B$12:$B$43,MATCH(LARGE((Scoreblad!$D$12:$D$43)+ROW(Scoreblad!$D$12:$D$43)/1000,ROW()-ROW($A$3)+1),(Scoreblad!$D$12:$D$43)+ROW(Scoreblad!$D$12:$D$43)/1000,0))","v":"Michiel Vroon"},{"$f":"INDEX(Scoreblad!$C$12:$C$43,MATCH(LARGE((Scoreblad!$D$12:$D$43)+ROW(Scoreblad!$D$12:$D$43)/1000,ROW()-ROW($A$3)+1),(Scoreblad!$D$12:$D$43)+ROW(Scoreblad!$D$12:$D$43)/1000,0))","v":18},{"$f":"LARGE(Scoreblad!$D$12:$D$43,ROW()-ROW($A$3)+1)","v":26.444444444444443},null,null,null,{"$f":"Scoreblad!B14","v":"Bart de Bot"},{"$f":"SUMIF(Scoreblad!$E$7:$BX$7,$A$36,Scoreblad!E14:BX14)","v":10},{"$f":"SUMIF(Scoreblad!$E$7:$BX$7,$A$36,Scoreblad!F14:BY14)","v":10},null,null,{"$f":"Scoreblad!B14","v":"Bart de Bot"},{"$f":"COUNTA(Scoreblad!BE14,Scoreblad!BI14,Scoreblad!BK14,Scoreblad!BM14,Scoreblad!BO14,Scoreblad!BG14)","v":5},{"$f":"IFERROR(SUM(Scoreblad!BJ14,Scoreblad!BH14,Scoreblad!BF14,Scoreblad!BL14,Scoreblad!BN14,Scoreblad!BP14)/COUNTA(Scoreblad!BE14,Scoreblad!BG14,Scoreblad!BI14,Scoreblad!BK14,Scoreblad!BM14,Scoreblad!BO14),\"\")","v":23.4}]
[{"$f":"INDEX(Scoreblad!$B$12:$B$43,MATCH(LARGE((Scoreblad!$D$12:$D$43)+ROW(Scoreblad!$D$12:$D$43)/1000,ROW()-ROW($A$3)+1),(Scoreblad!$D$12:$D$43)+ROW(Scoreblad!$D$12:$D$43)/1000,0))","v":"Daan vd Tuijn"},{"$f":"INDEX(Scoreblad!$C$12:$C$43,MATCH(LARGE((Scoreblad!$D$12:$D$43)+ROW(Scoreblad!$D$12:$D$43)/1000,ROW()-ROW($A$3)+1),(Scoreblad!$D$12:$D$43)+ROW(Scoreblad!$D$12:$D$43)/1000,0))","v":21},{"$f":"LARGE(Scoreblad!$D$12:$D$43,ROW()-ROW($A$3)+1)","v":26.285714285714285},null,null,null,{"$f":"Scoreblad!B15","v":"Boudewijn v/d Plas"},{"$f":"SUMIF(Scoreblad!$E$7:$BX$7,$A$36,Scoreblad!E15:BX15)","v":18},{"$f":"SUMIF(Scoreblad!$E$7:$BX$7,$A$36,Scoreblad!F15:BY15)","v":30},null,null,{"$f":"Scoreblad!B16","v":"Daan vd Tuijn"},{"$f":"COUNTA(Scoreblad!BE16,Scoreblad!BI16,Scoreblad!BK16,Scoreblad!BM16,Scoreblad!BO16,Scoreblad!BG16)","v":3},{"$f":"IFERROR(SUM(Scoreblad!BJ16,Scoreblad!BH16,Scoreblad!BF16,Scoreblad!BL16,Scoreblad!BN16,Scoreblad!BP16)/COUNTA(Scoreblad!BE16,Scoreblad!BG16,Scoreblad!BI16,Scoreblad!BK16,Scoreblad!BM16,Scoreblad!BO16),\"\")","v":20.333333333333332}]
[{"$f":"INDEX(Scoreblad!$B$12:$B$43,MATCH(LARGE((Scoreblad!$D$12:$D$43)+ROW(Scoreblad!$D$12:$D$43)/1000,ROW()-ROW($A$3)+1),(Scoreblad!$D$12:$D$43)+ROW(Scoreblad!$D$12:$D$43)/1000,0))","v":"Jan Hoogstrate"},{"$f":"INDEX(Scoreblad!$C$12:$C$43,MATCH(LARGE((Scoreblad!$D$12:$D$43)+ROW(Scoreblad!$D$12:$D$43)/1000,ROW()-ROW($A$3)+1),(Scoreblad!$D$12:$D$43)+ROW(Scoreblad!$D$12:$D$43)/1000,0))","v":25},{"$f":"LARGE(Scoreblad!$D$12:$D$43,ROW()-ROW($A$3)+1)","v":26},null,null,null,{"$f":"Scoreblad!B16","v":"Daan vd Tuijn"},{"$f":"SUMIF(Scoreblad!$E$7:$BX$7,$A$36,Scoreblad!E16:BX16)","v":0},{"$f":"SUMIF(Scoreblad!$E$7:$BX$7,$A$36,Scoreblad!F16:BY16)","v":0},null,null,{"$f":"Scoreblad!B17","v":"Dre Verhoef"},{"$f":"COUNTA(Scoreblad!BE17,Scoreblad!BI17,Scoreblad!BK17,Scoreblad!BM17,Scoreblad!BO17,Scoreblad!BG17)","v":3},{"$f":"IFERROR(SUM(Scoreblad!BJ17,Scoreblad!BH17,Scoreblad!BF17,Scoreblad!BL17,Scoreblad!BN17,Scoreblad!BP17)/COUNTA(Scoreblad!BE17,Scoreblad!BG17,Scoreblad!BI17,Scoreblad!BK17,Scoreblad!BM17,Scoreblad!BO17),\"\")","v":25.333333333333332}]
[{"$f":"INDEX(Scoreblad!$B$12:$B$43,MATCH(LARGE((Scoreblad!$D$12:$D$43)+ROW(Scoreblad!$D$12:$D$43)/1000,ROW()-ROW($A$3)+1),(Scoreblad!$D$12:$D$43)+ROW(Scoreblad!$D$12:$D$43)/1000,0))","v":"Jan Bierbooms"},{"$f":"INDEX(Scoreblad!$C$12:$C$43,MATCH(LARGE((Scoreblad!$D$12:$D$43)+ROW(Scoreblad!$D$12:$D$43)/1000,ROW()-ROW($A$3)+1),(Scoreblad!$D$12:$D$43)+ROW(Scoreblad!$D$12:$D$43)/1000,0))","v":25},{"$f":"LARGE(Scoreblad!$D$12:$D$43,ROW()-ROW($A$3)+1)","v":25.88},null,null,null,{"$f":"Scoreblad!B17","v":"Dre Verhoef"},{"$f":"SUMIF(Scoreblad!$E$7:$BX$7,$A$36,Scoreblad!E17:BX17)","v":18},{"$f":"SUMIF(Scoreblad!$E$7:$BX$7,$A$36,Scoreblad!F17:BY17)","v":30},null,null,{"$f":"Scoreblad!B18","v":"Eddy vd Tuijn"},{"$f":"COUNTA(Scoreblad!BE18,Scoreblad!BI18,Scoreblad!BK18,Scoreblad!BM18,Scoreblad!BO18,Scoreblad!BG18)","v":3},{"$f":"IFERROR(SUM(Scoreblad!BJ18,Scoreblad!BH18,Scoreblad!BF18,Scoreblad!BL18,Scoreblad!BN18,Scoreblad!BP18)/COUNTA(Scoreblad!BE18,Scoreblad!BG18,Scoreblad!BI18,Scoreblad!BK18,Scoreblad!BM18,Scoreblad!BO18),\"\")","v":12}]
[{"$f":"INDEX(Scoreblad!$B$12:$B$43,MATCH(LARGE((Scoreblad!$D$12:$D$43)+ROW(Scoreblad!$D$12:$D$43)/1000,ROW()-ROW($A$3)+1),(Scoreblad!$D$12:$D$43)+ROW(Scoreblad!$D$12:$D$43)/1000,0))","v":"Boudewijn v/d Plas"},{"$f":"INDEX(Scoreblad!$C$12:$C$43,MATCH(LARGE((Scoreblad!$D$12:$D$43)+ROW(Scoreblad!$D$12:$D$43)/1000,ROW()-ROW($A$3)+1),(Scoreblad!$D$12:$D$43)+ROW(Scoreblad!$D$12:$D$43)/1000,0))","v":21},{"$f":"LARGE(Scoreblad!$D$12:$D$43,ROW()-ROW($A$3)+1)","v":25.476190476190474},null,null,null,{"$f":"Scoreblad!B18","v":"Eddy vd Tuijn"},{"$f":"SUMIF(Scoreblad!$E$7:$BX$7,$A$36,Scoreblad!E18:BX18)","v":9},{"$f":"SUMIF(Scoreblad!$E$7:$BX$7,$A$36,Scoreblad!F18:BY18)","v":9},null,null,{"$f":"Scoreblad!B19","v":"Guust v/d Bemd"},{"$f":"COUNTA(Scoreblad!BE19,Scoreblad!BI19,Scoreblad!BK19,Scoreblad!BM19,Scoreblad!BO19,Scoreblad!BG19)","v":5},{"$f":"IFERROR(SUM(Scoreblad!BJ19,Scoreblad!BH19,Scoreblad!BF19,Scoreblad!BL19,Scoreblad!BN19,Scoreblad!BP19)/COUNTA(Scoreblad!BE19,Scoreblad!BG19,Scoreblad!BI19,Scoreblad!BK19,Scoreblad!BM19,Scoreblad!BO19),\"\")","v":20.6}]
[{"$f":"INDEX(Scoreblad!$B$12:$B$43,MATCH(LARGE((Scoreblad!$D$12:$D$43)+ROW(Scoreblad!$D$12:$D$43)/1000,ROW()-ROW($A$3)+1),(Scoreblad!$D$12:$D$43)+ROW(Scoreblad!$D$12:$D$43)/1000,0))","v":"Richard Smits"},{"$f":"INDEX(Scoreblad!$C$12:$C$43,MATCH(LARGE((Scoreblad!$D$12:$D$43)+ROW(Scoreblad!$D$12:$D$43)/1000,ROW()-ROW($A$3)+1),(Scoreblad!$D$12:$D$43)+ROW(Scoreblad!$D$12:$D$43)/1000,0))","v":20},{"$f":"LARGE(Scoreblad!$D$12:$D$43,ROW()-ROW($A$3)+1)","v":25.4},null,null,null,{"$f":"Scoreblad!B19","v":"Guust v/d Bemd"},{"$f":"SUMIF(Scoreblad!$E$7:$BX$7,$A$36,Scoreblad!E19:BX19)","v":19},{"$f":"SUMIF(Scoreblad!$E$7:$BX$7,$A$36,Scoreblad!F19:BY19)","v":31},null,null,{"$f":"Scoreblad!B20","v":"Jan Bierbooms"},{"$f":"COUNTA(Scoreblad!BE20,Scoreblad!BI20,Scoreblad!BK20,Scoreblad!BM20,Scoreblad!BO20,Scoreblad!BG20)","v":5},{"$f":"IFERROR(SUM(Scoreblad!BJ20,Scoreblad!BH20,Scoreblad!BF20,Scoreblad!BL20,Scoreblad!BN20,Scoreblad!BP20)/COUNTA(Scoreblad!BE20,Scoreblad!BG20,Scoreblad!BI20,Scoreblad!BK20,Scoreblad!BM20,Scoreblad!BO20),\"\")","v":28.4}]
{"$rows_left_out":27}
{"sheet":"Blad1","index":5,"n_rows":0,"n_cols":0,"rows_kept":0,"cut":false,"hidden":false,"merged":[]}